{"text_format":"1","workbook":"xlsx","n_sheets":3,"sheets":["BD Personal","Ejemplo sin macros","Ejemplo con macros"],"not_rendered":{"charts":0,"images":0,"macros":1,"external_links":0,"defined_names":2,"comments":0,"pivot_tables":0},"unopened":[],"bounds":{"document_bytes":16777216,"sheet_cells":100000,"rows_first":2000,"rows_last":500,"rows_between":2000,"halvings":0,"cell_chars":16384,"cell_head_chars":4096},"cells_cut":0,"cells_raw":0,"read":"whole","date_system":"1900"}

{"sheet":"BD Personal","index":0,"n_rows":401,"n_cols":12,"rows_kept":401,"cut":false,"hidden":false,"merged":[]}
["Código","Apellidos, Nombres","Cargo","Tipo Contrato","Fecha Ingreso","Fecha Fin de Contrato","Fecha Nacimiento","Sexo","Ubicación","Centro de Costo","Sueldo Básico","Bonificaciones"]
["00000451","Parra García, Jerónimo Santiago","Técnico","Plazo indeterminado","1985-01-06",null,"1956-09-08","M","Local 1","Gerencia 4",3313,199]
["00000536","Díaz García, Alexander Pedro","Profesional","Plazo indeterminado","1986-08-06",null,"1962-12-05","M","Local 1","Gerencia General",9376,469]
["00000596","Farías Rodríguez, Santiago Dylan","Técnico","Plazo indeterminado","1988-07-03",null,"1962-09-21","M","Local 2","Gerencia 3",3846,385]
["00000687","Rodríguez García, Santiago Rafael","Profesional","Plazo indeterminado","1989-07-04",null,"1961-10-31","M","Local 2","Gerencia 1",7101,497]
["00000714","Soria Fernández, Ramón Rodrigo","Profesional","Plazo indeterminado","1989-09-01",null,"1959-09-15","M","Local 3","Gerencia 1",5487,329]
["00000797","Valenzuela Núñez, Julieta Beatriz","Profesional","Plazo indeterminado","1992-01-08",null,"1966-05-29","F","Local 2","Gerencia 4",6765,474]
["00000819","Mendoza Silva, Benjamín Fabián","Técnico","Plazo indeterminado","1992-08-25",null,"1963-04-17","M","Local 3","Gerencia 5",4687,422]
["00000849","Rodríguez Flores, Iker Tomás","Técnico","Plazo indeterminado","1992-09-08",null,"1966-07-09","M","Local 3","Gerencia 2",5238,471]
["00000895","Espinosa Ferreyra, José Fabricio","Profesional","Plazo indeterminado","1992-11-04",null,"1967-12-22","M","Local 3","Gerencia 2",5545,499]
["00000933","Díaz Saavedra, Álvaro Marcelo","Técnico","Plazo indeterminado","1993-04-27",null,"1963-12-13","M","Local 2","Gerencia 5",4821,241]
["00000965","Morales Riquelme, Sofía Milagros","Profesional","Plazo indeterminado","1993-08-21",null,"1966-08-23","F","Local 1","Gerencia 5",5480,438]
["00000995","Flores Miranda, Daniela Ramona","Profesional","Plazo indeterminado","1994-01-04",null,"1968-01-03","F","Local 2","Gerencia 2",6058,424]
["00001018","Mendoza Venegas, Salomé Fernanda","Técnico","Plazo indeterminado","1994-01-25",null,"1969-08-01","F","Local 3","Gerencia 4",3412,273]
["00001024","Quiroga Bermúdez, Agustina Liz","Técnico","Plazo indeterminado","1994-03-20",null,"1968-05-26","F","Local 3","Gerencia 5",5944,594]
["00001060","Romero Romero, Alexander Marco","Técnico","Plazo indeterminado","1994-07-21",null,"1971-04-04","M","Local 3","Gerencia 2",5832,583]
["00001090","Castro Quispe, Martín Francisco","Profesional","Plazo indeterminado","1994-09-11",null,"1970-11-15","M","Local 3","Gerencia 1",9920,595]
["00001105","Quispe Figueroa, Ian Paolo","Profesional","Plazo indeterminado","1994-10-06",null,"1970-01-16","M","Local 3","Gerencia 2",7574,379]
["00001147","Jara Romero, Luis Marcelo","Técnico","Plazo indeterminado","1995-01-14",null,"1972-10-08","M","Local 2","Gerencia 5",3970,357]
["00001170","Díaz Luna, Abril Maite","Técnico","Plazo indeterminado","1995-07-14",null,"1968-03-20","F","Local 3","Gerencia 2",4148,207]
["00001199","Domínguez Castillo, Mario Bautista","Profesional","Plazo indeterminado","1995-08-26",null,"1963-07-25","M","Local 3","Gerencia 2",8047,644]
["00001221","Juárez Herrera, José Felipe","Técnico","Plazo indeterminado","1995-10-24",null,"1971-02-24","M","Local 3","Gerencia 5",2934,176]
["00001230","Vega Romero, Sarah Maite","Profesional","Plazo indeterminado","1996-03-13",null,"1970-06-29","F","Local 1","Gerencia 4",8793,879]
["00001280","Romero Soto, Bruno Marco","Profesional","Plazo indeterminado","1996-03-26",null,"1966-05-09","M","Local 3","Gerencia 3",9664,966]
["00001285","Herrera Guerrero, Alexander Francisco","Profesional","Plazo indeterminado","1996-06-08",null,"1972-03-07","M","Local 3","Gerencia 5",5147,412]
["00001303","Pereyra Torres, Jesús Luis","Técnico","Plazo indeterminado","1996-06-29",null,"1972-07-15","M","Local 1","Gerencia 3",3632,327]
["00001340","Ortiz Gómez, Lucas Fabio","Profesional","Plazo indeterminado","1996-11-13",null,"1970-03-13","M","Local 2","Gerencia 4",9564,956]
["00001357","Ramos Tapia, Felipe Iker","Técnico","Plazo indeterminado","1997-03-11",null,"1971-08-30","M","Local 3","Gerencia 5",3778,264]
["00001383","Cortés Quispe, Héctor Samuel","Profesional","Plazo indeterminado","1997-03-17",null,"1973-09-16","M","Local 3","Gerencia 1",8898,445]
["00001396","Rojas Vera, Alonso Ricardo","Profesional","Plazo indeterminado","1997-03-25",null,"1973-04-22","M","Local 3","Gerencia 2",6787,679]
["00001408","López Gutiérrez, Lucía Nicole","Ejecutivo","Plazo indeterminado","1997-05-08",null,"1971-09-02","F","Local 1","Gerencia 2",16338,1470]
["00001440","Ramírez Navarro, Paula Gabriela","Profesional","Plazo indeterminado","1997-06-18",null,"1969-04-24","F","Local 1","Gerencia 1",8513,851]
["00001480","Guzmán Chávez, César Felipe","Profesional","Plazo indeterminado","1997-09-14",null,"1973-03-17","M","Local 3","Gerencia 1",7124,570]
["00001499","Paredes Godoy, Pedro Jesús","Técnico","Plazo indeterminado","1997-11-08",null,"1970-08-26","M","Local 2","Gerencia 5",2954,207]
["00001504","Castro Blanco, Olivia Alexandra","Técnico","Plazo indeterminado","1997-11-22",null,"1969-12-10","F","Local 1","Gerencia 5",4583,458]
["00001539","Aguilera Carvajal, Antonio Javier","Técnico","Plazo indeterminado","1998-01-01",null,"1965-09-19","M","Local 3","Gerencia 1",4767,286]
["00001583","Godoy Villalba, Mario Ian","Técnico","Plazo indeterminado","1998-03-21",null,"1974-07-17","M","Local 2","Gerencia 5",4054,243]
["00001606","Godoy Reyes, José Ignacio","Técnico","Plazo indeterminado","1998-04-15",null,"1971-10-07","M","Local 2","Gerencia 4",3505,210]
["00001623","Ortega Gómez, Carlos Francisco","Técnico","Plazo indeterminado","1998-06-25",null,"1967-01-21","M","Local 2","Gerencia 5",5535,332]
["00001646","Martín Torres, Pedro Francisco","Profesional","Plazo indeterminado","1998-07-23",null,"1969-10-25","M","Local 1","Gerencia 2",6912,484]
["00001694","Romero Vargas, Arturo André","Ejecutivo","Plazo indeterminado","1998-08-02",null,"1968-06-04","M","Local 1","Gerencia 1",14264,1712]
["00001711","Villalba Flores, Héctor Hugo","Técnico","Plazo indeterminado","1999-01-14",null,"1965-12-23","M","Local 3","Gerencia 3",5793,348]
["00001723","Bustos Poblete, Carla Fernanda","Técnico","Plazo indeterminado","1999-03-09",null,"1974-09-14","F","Local 2","Gerencia 1",3043,274]
["00001738","Flores Ramos, Rafael Álvaro","Profesional","Plazo indeterminado","1999-03-18",null,"1971-04-12","M","Local 2","Gerencia 5",8801,440]
["00001744","Gómez Toledo, Micaela Alessandra","Ejecutivo","Plazo indeterminado","1999-05-02",null,"1967-04-02","F","Local 1","Gerencia 1",21350,2776]
["00001749","Fernández Mamani, Adrián Thiago","Profesional","Plazo indeterminado","1999-05-18",null,"1976-07-31","M","Local 1","Gerencia 3",8475,509]
["00001769","Bravo Arias, Javier Nicolás","Profesional","Plazo indeterminado","1999-05-25",null,"1975-03-05","M","Local 3","Gerencia 5",8257,661]
["00001777","Montenegro Campos, Victoria Valeria","Técnico","Plazo indeterminado","1999-06-01",null,"1974-02-14","F","Local 2","Gerencia 3",2821,197]
["00001797","Coronel Vázquez, Sara Florencia","Técnico","Plazo indeterminado","1999-07-05",null,"1965-04-18","F","Local 2","Gerencia 1",3538,248]
["00001803","Núñez Saavedra, Alonso Adrián","Técnico","Plazo indeterminado","1999-07-24",null,"1970-04-07","M","Local 1","Gerencia 1",5853,293]
["00001810","Quispe Torres, Martina Antonella","Profesional","Plazo indeterminado","1999-08-25",null,"1968-02-16","F","Local 2","Gerencia 2",5779,578]
["00001827","Contreras López, Gonzalo Jesús","Profesional","Plazo indeterminado","1999-09-05",null,"1976-09-01","M","Local 1","Gerencia 2",9842,984]
["00001837","Araya Herrera, Alonso Nicolás","Profesional","Plazo indeterminado","1999-09-08",null,"1975-06-04","M","Local 2","Gerencia 3",5584,391]
["00001857","Navarro Pino, Carolina Alma","Técnico","Plazo indeterminado","1999-11-28",null,"1968-06-03","F","Local 2","Gerencia 1",3429,274]
["00001872","Vázquez Soria, Sofía","Técnico","Plazo indeterminado","1999-12-21",null,"1976-07-30","F","Local 1","Gerencia 2",3045,213]
["00001884","García Godoy, Fabio Álvaro","Técnico","Plazo indeterminado","1999-12-30",null,"1976-04-30","M","Local 2","Gerencia 2",4896,441]
["00001892","Carvajal García, Pablo Ángel","Técnico","Plazo indeterminado","2000-01-10",null,"1977-10-05","M","Local 2","Gerencia 3",3476,243]
["00001898","Romero Roldán, Alessandra Nicole","Técnico","Plazo indeterminado","2000-02-10",null,"1964-05-23","F","Local 2","Gerencia 1",3849,385]
["00001906","Yáñez Ramírez, Gonzalo Alejandro","Profesional","Plazo indeterminado","2000-02-13",null,"1976-12-10","M","Local 1","Gerencia 3",9411,659]
["00001921","Rojas Díaz, Josefa Manuela","Técnico","Plazo indeterminado","2000-03-04",null,"1977-05-03","F","Local 3","Gerencia 1",3439,172]
["00001934","Jiménez Miranda, Valentina Liz","Técnico","Plazo indeterminado","2000-03-14",null,"1970-01-15","F","Local 2","Gerencia 2",3003,150]
["00001948","Benítez Reyes, Ignacio Mateo","Ejecutivo","Plazo indeterminado","2000-04-02",null,"1962-04-01","M","Local 2","Gerencia 3",19549,1955]
["00001966","Acosta Lucero, Fabio Hugo","Técnico","Plazo indeterminado","2000-04-21",null,"1972-01-31","M","Local 3","Gerencia 4",3654,256]
["00001975","Díaz Godoy, Sebastián Renzo","Profesional","Plazo indeterminado","2000-05-09",null,"1971-02-06","M","Local 1","Gerencia 2",7553,529]
["00001994","Acosta Parra, Arturo Javier","Técnico","Plazo indeterminado","2000-05-23",null,"1968-11-14","M","Local 3","Gerencia 2",4442,267]
["00002001","Muñoz Pino, Carolina Andrea","Técnico","Plazo indeterminado","2000-07-18",null,"1974-03-11","F","Local 2","Gerencia 2",4677,421]
["00002013","Reyes Tapia, Fernanda Micaela","Profesional","Plazo indeterminado","2000-09-15",null,"1974-02-14","F","Local 1","Gerencia 3",5890,412]
["00002019","Bravo Moyano, Mario Bautista","Profesional","Plazo indeterminado","2000-09-24",null,"1969-04-24","M","Local 1","Gerencia 4",6802,544]
["00002039","Hernández Carrasco, Carla Samantha","Técnico","Plazo indeterminado","2000-09-26",null,"1977-04-25","F","Local 2","Gerencia 1",4206,421]
["00002058","Figueroa San Martín, Paolo Javier","Técnico","Plazo indeterminado","2000-10-02",null,"1977-02-03","M","Local 3","Gerencia 4",4296,215]
["00002077","Sánchez Mendoza, Salvador Nicolás","Técnico","Plazo indeterminado","2000-10-08",null,"1968-06-30","M","Local 2","Gerencia 1",3105,155]
["00002091","Carvajal Valdez, Renzo Rodrigo","Profesional","Plazo indeterminado","2000-10-13",null,"1966-01-08","M","Local 2","Gerencia 1",6373,446]
["00002100","Coronel Mansilla, Mauricio Juan","Profesional","Plazo indeterminado","2000-12-14",null,"1973-07-20","M","Local 1","Gerencia 5",7810,781]
["00002111","Vázquez Aguirre, Mabel Raquel","Técnico","Plazo indeterminado","2001-01-24",null,"1972-01-10","F","Local 1","Gerencia 1",3115,156]
["00002131","Leguizamón Leiva, Pablo Benjamín","Profesional","Plazo indeterminado","2001-02-17",null,"1972-05-11","M","Local 2","Gerencia 3",5352,375]
["00002145","Vargas Rodríguez, Adrián Rafael","Técnico","Plazo indeterminado","2001-07-13",null,"1975-12-23","M","Local 2","Gerencia 2",4438,311]
["00002159","Muñoz Parra, Matías Francisco","Profesional","Plazo indeterminado","2001-07-25",null,"1976-06-17","M","Local 2","Gerencia 4",6921,692]
["00002164","Jiménez Vargas, Matías Ricardo","Ejecutivo","Plazo indeterminado","2001-08-28",null,"1965-12-18","M","Local 2","Gerencia 3",18717,1497]
["00002174","Quispe Mansilla, Victoria Valentina","Alta Gerencia","Plazo indeterminado","2001-11-21",null,"1975-03-13","F","Local 1","Gerencia 1",21706,2171]
["00002189","Valdés Fernández, Ramón Agustín","Técnico","Plazo indeterminado","2001-11-28",null,"1963-07-30","M","Local 3","Gerencia 3",5932,297]
["00002209","Herrera Molina, Abril Josefa","Técnico","Plazo indeterminado","2001-11-30",null,"1967-05-05","F","Local 3","Gerencia 2",4569,228]
["00002217","Garrido Flores, Vicente Carlos","Profesional","Plazo indeterminado","2002-01-09",null,"1955-10-16","M","Local 2","Gerencia 2",7276,509]
["00002236","Montenegro Henríquez, Carlos Antonio","Profesional","Plazo indeterminado","2002-01-20",null,"1970-08-19","M","Local 3","Gerencia 3",6214,559]
["00002251","Martínez Benítez, Josefa Giovanna","Profesional","Plazo indeterminado","2002-01-30",null,"1973-01-23","F","Local 2","Gerencia 4",9262,556]
["00002262","García Quispe, Hugo Vicente","Técnico","Plazo indeterminado","2002-03-21",null,"1955-02-09","M","Local 2","Gerencia 5",3865,232]
["00002273","Olivares Arias, Benjamín Fabricio","Profesional","Plazo indeterminado","2002-03-30",null,"1978-05-08","M","Local 2","Gerencia 3",7374,664]
["00002282","Villalba Pereyra, Paolo Thiago","Alta Gerencia","Plazo indeterminado","2002-04-04",null,"1966-08-02","M","Local 1","Gerencia 2",29415,2942]
["00002296","Cruz Hernández, Renzo Diego","Profesional","Plazo indeterminado","2002-05-11",null,"1978-08-13","M","Local 2","Gerencia 4",7299,657]
["00002311","Sosa Cedeño, Juan Fabián","Profesional","Plazo indeterminado","2002-06-10",null,"1970-09-29","M","Local 1","Gerencia 3",8674,434]
["00002320","Miranda Fermín, Joaquín Dylan","Profesional","Plazo indeterminado","2002-06-12",null,"1969-10-19","M","Local 2","Gerencia 1",9692,969]
["00002337","García Paredes, Ximena Valeria","Técnico","Plazo indeterminado","2002-06-21",null,"1962-04-13","F","Local 3","Gerencia 2",3779,340]
["00002346","Espinoza Muñoz, Mateo Rafael","Técnico","Plazo indeterminado","2002-07-03",null,"1969-04-27","M","Local 2","Gerencia 4",2875,144]
["00002353","Chávez López, Julia Maya","Técnico","Plazo indeterminado","2002-07-31",null,"1966-02-21","F","Local 2","Gerencia 3",3495,280]
["00002359","Navarro Salazar, Santino Alonso","Técnico","Plazo indeterminado","2002-08-15",null,"1978-11-14","M","Local 2","Gerencia 4",3079,154]
["00002367","Díaz García, Joaquín Fabio","Técnico","Plazo indeterminado","2002-09-21",null,"1970-09-23","M","Local 1","Gerencia 2",5575,390]
["00002374","Sosa Álvarez, Sara Julia","Técnico","Plazo indeterminado","2003-01-01",null,"1975-06-26","F","Local 2","Gerencia 4",5565,390]
["00002390","Miranda Gómez, Benjamín André","Técnico","Plazo indeterminado","2003-01-20",null,"1972-12-27","M","Local 2","Gerencia 5",5029,402]
["00002396","Flores Torres, Camila Florencia","Técnico","Plazo indeterminado","2003-01-26",null,"1978-04-02","F","Local 2","Gerencia 3",3855,308]
["00002416","Quispe Ojeda, Joaquín Marco","Profesional","Plazo indeterminado","2003-01-28",null,"1973-09-08","M","Local 2","Gerencia 2",7332,587]
["00002423","Álvarez Hernández, Samantha Mia","Técnico","Plazo indeterminado","2003-01-28",null,"1980-10-14","F","Local 1","Gerencia 1",5091,305]
["00002440","Ramos Rojas, Milagros Martina","Técnico","Plazo indeterminado","2003-02-05",null,"1968-07-16","F","Local 2","Gerencia 4",3550,355]
["00002460","Lagos Ramos, Rodrigo Ramón","Ejecutivo","Plazo indeterminado","2003-02-15",null,"1972-10-15","M","Local 1","Gerencia 2",12292,1598]
["00002472","Martín Fernández, Santino Ricardo","Técnico","Plazo indeterminado","2003-02-21",null,"1975-04-02","M","Local 3","Gerencia 3",5388,539]
["00002485","Escobar Cáceres, Ricardo Jesús","Profesional","Plazo indeterminado","2003-03-15",null,"1979-04-23","M","Local 3","Gerencia 2",5341,267]
["00002502","Ruiz Castillo, Adrián Juan","Profesional","Plazo indeterminado","2003-04-04",null,"1978-09-18","M","Local 3","Gerencia 2",6280,628]
["00002521","Fermín Rivera, Adrián Carlos","Técnico","Plazo indeterminado","2003-04-26",null,"1970-11-27","M","Local 1","Gerencia 3",3053,183]
["00002533","Vega Díaz, David Samuel","Técnico","Plazo indeterminado","2003-05-19",null,"1979-02-03","M","Local 1","Gerencia 3",3697,259]
["00002553","Montenegro Paz, Marco Fabio","Técnico","Plazo indeterminado","2003-05-30",null,"1979-10-31","M","Local 3","Gerencia 4",4479,358]
["00002573","Fermín Olivares, José Agustín","Profesional","Plazo indeterminado","2003-06-04",null,"1977-05-06","M","Local 3","Gerencia 2",9049,814]
["00002578","Ramírez Castro, Adrián Fabián","Técnico","Plazo indeterminado","2003-06-07",null,"1963-10-10","M","Local 2","Gerencia 2",5615,281]
["00002588","Quispe Escobar, Luis César","Técnico","Plazo indeterminado","2003-07-09",null,"1979-11-25","M","Local 1","Gerencia 5",4000,200]
["00002602","Muñoz Aguirre, Arturo Diego","Profesional","Plazo indeterminado","2003-07-27",null,"1974-11-10","M","Local 2","Gerencia 4",6331,506]
["00002615","Flores González, Elizabeth Julieta","Técnico","Plazo indeterminado","2003-08-04",null,"1969-02-02","F","Local 3","Gerencia 3",4775,239]
["00002620","Gómez Godoy, Franco César","Técnico","Plazo indeterminado","2003-08-07",null,"1965-05-12","M","Local 2","Gerencia 1",5430,543]
["00002639","Medina Valdez, Joaquín Maximiliano","Técnico","Plazo indeterminado","2003-08-30",null,"1974-09-06","M","Local 1","Gerencia 3",2926,146]
["00002656","Ramírez Medina, Santino Arturo","Técnico","Plazo indeterminado","2003-10-09",null,"1977-02-22","M","Local 2","Gerencia 3",4942,346]
["00002663","Franco Moyano, Fabio Antonio","Técnico","Plazo indeterminado","2003-10-23",null,"1969-09-22","M","Local 2","Gerencia 5",5060,455]
["00002675","Domínguez Ruiz, Amanda Naomi","Técnico","Plazo indeterminado","2004-01-05",null,"1971-08-02","F","Local 3","Gerencia 4",4125,206]
["00002680","Vera Martín, Santiago Fabio","Profesional","Plazo indeterminado","2004-02-22",null,"1970-07-16","M","Local 3","Gerencia 3",9720,778]
["00002691","Salinas Ledesma, Gabriel José","Profesional","Plazo indeterminado","2004-02-26",null,"1980-06-04","M","Local 3","Gerencia 5",6093,487]
["00002699","Rojas Méndez, Fabián André","Alta Gerencia","Plazo indeterminado","2004-03-06",null,"1981-05-02","M","Local 1","Gerencia General",36000,5040]
["00002714","Sánchez Vargas, Agustín Thiago","Técnico","Plazo indeterminado","2004-04-14",null,"1970-05-10","M","Local 3","Gerencia 5",3253,228]
["00002733","Cruz Sáez, Bautista Paolo","Profesional","Plazo indeterminado","2004-05-15",null,"1970-06-15","M","Local 3","Gerencia 4",9739,584]
["00002745","Chávez Coronel, Nicolás Rodrigo","Técnico","Plazo indeterminado","2004-06-05",null,"1971-01-05","M","Local 3","Gerencia 3",4294,429]
["00002761","Rodríguez Rodríguez, André Ian","Profesional","Plazo indeterminado","2004-08-24",null,"1979-06-06","M","Local 3","Gerencia 1",9509,856]
["00002773","Pérez Rojas, Antonio Rafael","Profesional","Plazo indeterminado","2004-09-06",null,"1976-08-31","M","Local 3","Gerencia 3",7294,729]
["00002780","Vidal Muñoz, María Carolina","Técnico","Plazo indeterminado","2004-09-28",null,"1981-10-30","F","Local 1","Gerencia General",5973,418]
["00002793","Sepúlveda Ramírez, Pedro Ian","Profesional","Plazo indeterminado","2004-10-01",null,"1965-11-18","M","Local 2","Gerencia 4",6764,609]
["00002813","Gutiérrez Aguilera, Ricardo Ramón","Profesional","Plazo indeterminado","2004-10-11",null,"1976-01-29","M","Local 3","Gerencia 5",6132,491]
["00002824","Díaz Pérez, Luisa Agustina","Técnico","Plazo indeterminado","2004-10-30",null,"1980-11-15","F","Local 2","Gerencia 2",3562,321]
["00002833","Navarro Zúñiga, Jesús Benjamín","Alta Gerencia","Plazo indeterminado","2004-10-31",null,"1970-01-08","M","Local 1","Gerencia 3",26317,3948]
["00002839","Sáez Flores, Isidora Isabella","Profesional","Plazo indeterminado","2004-11-24",null,"1973-05-14","F","Local 1","Gerencia 5",6370,573]
["00002851","Jiménez Salazar, Antonella Naomi","Técnico","Plazo indeterminado","2004-12-07",null,"1971-03-25","F","Local 1","Gerencia 5",3670,294]
["00002868","Ramírez Méndez, Bruno Ricardo","Ejecutivo","Plazo indeterminado","2004-12-08",null,"1972-12-13","M","Local 3","Gerencia 5",21873,2625]
["00002879","Garrido Flores, Bruno Francisco","Profesional","Plazo indeterminado","2004-12-24",null,"1982-10-13","M","Local 3","Gerencia 5",6787,339]
["00002886","Ferreyra Cardozo, Alexandra Salomé","Técnico","Plazo indeterminado","2005-02-27",null,"1982-05-15","F","Local 2","Gerencia 4",2961,207]
["00002905","Quispe Rodríguez, Ignacio Samuel","Profesional","Plazo indeterminado","2005-03-06",null,"1972-05-08","M","Local 3","Gerencia 5",9807,490]
["00002920","Castro Bustos, Paula Alma","Profesional","Plazo indeterminado","2005-03-08",null,"1978-02-14","F","Local 1","Gerencia 3",8048,724]
["00002936","Escobar Navarrete, José Martín","Técnico","Plazo indeterminado","2005-04-12",null,"1980-08-11","M","Local 3","Gerencia 5",4799,384]
["00002946","Donoso Moreno, Héctor Jesús","Técnico","Plazo indeterminado","2005-04-29",null,"1970-09-03","M","Local 2","Gerencia 3",4331,390]
["00002957","Mamani Silva, Bruno Santiago","Técnico","Plazo indeterminado","2005-05-09",null,"1980-01-29","M","Local 2","Gerencia 2",4816,385]
["00002967","Ruiz Quispe, Alondra Andrea","Técnico","Plazo indeterminado","2005-05-22",null,"1981-03-13","F","Local 3","Gerencia 3",4876,244]
["00002983","Ramos Parra, Pedro Lucas","Técnico","Plazo indeterminado","2005-05-25",null,"1981-05-10","M","Local 1","Gerencia 1",5081,457]
["00002992","Tapia Romero, Marco Ángel","Profesional","Plazo indeterminado","2005-07-01",null,"1976-12-17","M","Local 3","Gerencia 4",9705,485]
["00002999","González Alvarado, Arturo Marco","Técnico","Plazo indeterminado","2005-07-04",null,"1965-03-22","M","Local 3","Gerencia 5",4149,249]
["00003010","Gutiérrez Barrios, Mauricio André","Técnico","Plazo indeterminado","2005-07-10",null,"1972-09-25","M","Local 2","Gerencia 3",4328,303]
["00003029","Molina Figueroa, Héctor Diego","Técnico","Plazo indeterminado","2005-07-15",null,"1969-07-18","M","Local 2","Gerencia 5",4254,255]
["00003040","Gómez Vázquez, Salvador Lucas","Profesional","Plazo indeterminado","2005-07-28",null,"1969-06-25","M","Local 1","Gerencia 4",9532,572]
["00003060","Morales Muñoz, Luis Mario","Profesional","Plazo indeterminado","2005-07-28",null,"1969-09-09","M","Local 3","Gerencia 3",6303,630]
["00003072","Alarcón Muñoz, Benjamín Marcelo","Técnico","Plazo indeterminado","2005-09-03",null,"1981-06-08","M","Local 1","Gerencia 4",3356,235]
["00003090","Gómez Maldonado, Benjamín César","Técnico","Plazo indeterminado","2005-10-04",null,"1968-01-18","M","Local 3","Gerencia 1",4153,374]
["00003100","Castro Silva, Florencia Alondra","Técnico","Plazo indeterminado","2005-10-04",null,"1980-07-21","F","Local 3","Gerencia 2",5419,542]
["00003119","Bustamante Vázquez, Andrés Diego","Profesional","Plazo indeterminado","2005-11-18",null,"1971-07-03","M","Local 2","Gerencia 3",9246,647]
["00003126","Quispe Castillo, Pedro Franco","Profesional","Plazo indeterminado","2005-12-08",null,"1972-04-09","M","Local 3","Gerencia 1",6159,493]
["00003141","Ramos Escobar, Emily Victoria","Técnico","Plazo indeterminado","2005-12-11",null,"1974-06-06","F","Local 3","Gerencia 5",5718,572]
["00003161","García Vera, Héctor Marcelo","Técnico","Plazo indeterminado","2005-12-12",null,"1975-01-05","M","Local 1","Gerencia 1",3711,186]
["00003168","Campos Espinosa, Fabio Daniel","Técnico","Plazo indeterminado","2005-12-19",null,"1978-11-07","M","Local 3","Gerencia 2",5642,451]
["00003178","Núñez Gallardo, Nicolás Fabián","Técnico","Plazo indeterminado","2005-12-24",null,"1979-12-28","M","Local 3","Gerencia 1",4442,311]
["00003196","Gutiérrez Mansilla, Antonella Valeria","Técnico","Plazo indeterminado","2005-12-28",null,"1975-04-26","F","Local 3","Gerencia 5",4477,448]
["00003215","Maidana Silva, Agustín Marco","Profesional","Plazo indeterminado","2006-01-15",null,"1980-09-30","M","Local 2","Gerencia 3",9908,694]
["00003220","Jiménez Hernández, María Agustina","Técnico","Plazo indeterminado","2006-01-30",null,"1981-07-02","F","Local 3","Gerencia 1",3499,280]
["00003234","Rojas Rojas, André Daniel","Profesional","Plazo indeterminado","2006-03-13",null,"1979-12-16","M","Local 2","Gerencia 1",6304,630]
["00003251","Cabrera Cáceres, David Álvaro","Técnico","Plazo indeterminado","2006-03-28",null,"1965-07-28","M","Local 2","Gerencia 5",3614,361]
["00003264","Gutiérrez Jaramillo, David Mateo","Técnico","Plazo indeterminado","2006-04-21",null,"1978-10-18","M","Local 1","Gerencia 3",4545,227]
["00003278","Cedeño García, Gabriel Agustín","Ejecutivo","Plazo indeterminado","2006-05-01",null,"1971-02-12","M","Local 1","Gerencia 1",18799,1880]
["00003297","Sánchez Alarcón, Daniela Alma","Técnico","Plazo indeterminado","2006-05-24",null,"1976-01-22","F","Local 3","Gerencia 1",4713,377]
["00003310","Carrizo Cruz, Ariana Liz","Profesional","Plazo indeterminado","2006-06-11",null,"1980-09-18","F","Local 1","Gerencia 2",7411,593]
["00003320","Flores Vargas, Alessandra Manuela","Profesional","Plazo indeterminado","2006-06-27",null,"1979-11-23","F","Local 1","Gerencia 1",5920,474]
["00003330","Ruiz Rojas, Mabel Emma","Técnico","Plazo indeterminado","2006-07-19",null,"1971-02-19","F","Local 3","Gerencia 5",5558,556]
["00003336","Velázquez Ferreyra, Daniel Pablo","Profesional","Plazo indeterminado","2006-08-30",null,"1980-03-17","M","Local 2","Gerencia 1",8575,772]
["00003349","Ferrari Morales, Alexander Felipe","Profesional","Plazo indeterminado","2006-08-31",null,"1974-11-14","M","Local 3","Gerencia 3",7349,514]
["00003361","Jiménez Escobar, Bautista Renzo","Profesional","Plazo indeterminado","2006-09-05",null,"1977-08-04","M","Local 3","Gerencia 1",5811,407]
["00003370","Soria Ruiz, Alonso Ignacio","Técnico","Plazo indeterminado","2006-10-16",null,"1981-10-26","M","Local 2","Gerencia 2",5551,389]
["00003382","Cortés Contreras, Alexander Marco","Profesional","Plazo indeterminado","2006-12-02",null,"1966-11-01","M","Local 2","Gerencia 1",7878,551]
["00003387","Cortés Sandoval, María Salomé","Técnico","Plazo indeterminado","2006-12-16",null,"1982-08-29","F","Local 1","Gerencia 1",3529,282]
["00003402","Chávez Soto, Luis Antonio","Técnico","Plazo indeterminado","2006-12-26",null,"1975-08-30","M","Local 1","Gerencia 5",4563,319]
["00003421","Reyes Mamani, Isabella Emma","Profesional","Plazo indeterminado","2007-01-03",null,"1965-07-18","F","Local 1","Gerencia 4",7555,756]
["00003432","Salazar Bravo, Giovanna Alexandra","Técnico","Plazo indeterminado","2007-01-27",null,"1977-08-14","F","Local 2","Gerencia 2",5373,269]
["00003442","Olivares Sáez, Natalia Liz","Técnico","Plazo indeterminado","2007-02-06",null,"1968-06-11","F","Local 1","Gerencia 2",5957,596]
["00003450","Torres Quispe, Gabriela Sofía","Técnico","Plazo indeterminado","2007-02-16",null,"1957-04-10","F","Local 3","Gerencia 4",4608,461]
["00003464","Fermín Rojas, Raquel Sarah","Ejecutivo","Plazo indeterminado","2007-03-05",null,"1976-01-17","F","Local 1","Gerencia 3",15333,1380]
["00003473","García Figueroa, Agustín Daniel","Ejecutivo","Plazo indeterminado","2007-03-31",null,"1970-04-09","M","Local 1","Gerencia 2",10320,826]
["00003488","Méndez Jaramillo, Juan Héctor","Técnico","Plazo indeterminado","2007-05-07",null,"1980-11-24","M","Local 2","Gerencia 3",2960,207]
["00003495","Cortés Jaramillo, Andrés Tomás","Técnico","Plazo indeterminado","2007-06-09",null,"1979-08-19","M","Local 3","Gerencia 5",4666,420]
["00003514","Rojas Guzmán, Bruno Ian","Profesional","Plazo indeterminado","2007-06-15",null,"1971-09-30","M","Local 3","Gerencia 3",6816,682]
["00003531","Figueroa Luna, Carlos Jerónimo","Profesional","Plazo indeterminado","2007-07-17",null,"1974-01-26","M","Local 1","Gerencia 1",5544,277]
["00003538","Vega Cáceres, Marco Pedro","Ejecutivo","Plazo indeterminado","2007-07-22",null,"1982-03-19","M","Local 2","Gerencia 4",13585,1087]
["00003555","Álvarez Morales, Elizabeth Concepción","Técnico","Plazo indeterminado","2007-09-12",null,"1984-07-22","F","Local 3","Gerencia 4",5674,454]
["00003569","Quispe Romero, Raquel Fernanda","Técnico","Plazo indeterminado","2007-09-18",null,"1976-02-04","F","Local 2","Gerencia 1",3814,305]
["00003588","Hernández Díaz, Paula Alondra","Técnico","Plazo indeterminado","2007-11-03",null,"1977-08-17","F","Local 2","Gerencia 4",3534,283]
["00003604","Ortega Navarro, Valentina Mariana","Técnico","Plazo indeterminado","2007-11-22",null,"1981-10-22","F","Local 1","Gerencia 4",5995,360]
["00003610","Cortés Quispe, Rafael Jesús","Profesional","Plazo indeterminado","2008-01-21",null,"1968-12-25","M","Local 1","Gerencia 2",5829,408]
["00003625","Martínez Valenzuela, Fabián Rafael","Técnico","Plazo indeterminado","2008-01-24",null,"1977-10-11","M","Local 3","Gerencia 1",5376,538]
["00003644","Bustamante Ledesma, Emilia Ximena","Técnico","Plazo indeterminado","2008-02-23",null,"1983-01-25","F","Local 3","Gerencia 2",4316,302]
["00003662","Vargas López, Bernardo","Técnico","Plazo indeterminado","2008-03-13",null,"1976-10-14","M","Local 3","Gerencia 2",5187,415]
["00003668","Leguizamón Fernández, Salvador Benjamín","Técnico","Plazo indeterminado","2008-03-22",null,"1966-10-13","M","Local 3","Gerencia 1",3192,160]
["00003680","Rojas Aravena, Thiago Daniel","Profesional","Plazo indeterminado","2008-04-05",null,"1974-02-18","M","Local 3","Gerencia 4",7097,568]
["00003685","Flores Aguirre, Concepción Camila","Técnico","Plazo indeterminado","2008-04-07",null,"1972-10-24","F","Local 3","Gerencia 4",4149,415]
["00003695","Gómez Sandoval, Nicole Valentina","Técnico","Plazo indeterminado","2008-04-08",null,"1970-09-25","F","Local 2","Gerencia 4",3828,345]
["00003700","Arce Farías, Noemí Julia","Técnico","Plazo indeterminado","2008-04-21",null,"1982-11-12","F","Local 3","Gerencia 5",3619,326]
["00003717","Luna Castillo, Beatriz Alondra","Profesional","Plazo indeterminado","2008-04-25",null,"1967-06-09","F","Local 2","Gerencia 3",6356,318]
["00003730","Leiva Sánchez, Mariana Amanda","Técnico","Plazo indeterminado","2008-06-11",null,"1976-06-11","F","Local 3","Gerencia 2",4016,321]
["00003745","Reyes Díaz, Naomi Mariana","Técnico","Plazo indeterminado","2008-06-19",null,"1982-12-28","F","Local 2","Gerencia 1",5572,390]
["00003756","Silva Torres, Thiago Sebastián","Profesional","Plazo indeterminado","2008-07-01",null,"1967-05-12","M","Local 1","Gerencia 4",6556,459]
["00003761","Escobar Ruiz, Milagros Luz","Técnico","Plazo indeterminado","2008-07-23",null,"1971-09-17","F","Local 1","Gerencia 5",4483,448]
["00003781","González Miranda, Bautista Rafael","Profesional","Plazo indeterminado","2008-08-19",null,"1955-07-12","M","Local 3","Gerencia 5",5923,474]
["00003789","Jiménez Gutiérrez, Gonzalo Javier","Profesional","Plazo indeterminado","2008-09-04",null,"1974-03-25","M","Local 3","Gerencia 2",8455,507]
["00003796","Barrios Álvarez, Maya Emma","Técnico","Plazo indeterminado","2008-09-17",null,"1977-10-22","F","Local 2","Gerencia 1",5719,515]
["00003814","Navarro Vargas, Vicente Matías","Ejecutivo","Plazo indeterminado","2008-09-30",null,"1982-03-28","M","Local 2","Gerencia 3",20582,2676]
["00003826","Soto Herrera, Samuel Santiago","Profesional","Plazo indeterminado","2008-10-10",null,"1971-08-10","M","Local 2","Gerencia 5",5926,533]
["00003842","Suárez Sánchez, Sofía Paula","Técnico","Plazo indeterminado","2008-10-31",null,"1984-03-07","F","Local 3","Gerencia 2",5153,258]
["00003851","Rojas Velázquez, Manuela Zoe","Técnico","Plazo indeterminado","2008-11-01",null,"1980-04-01","F","Local 2","Gerencia 2",3914,235]
["00003863","Carrizo Romero, Jerónimo José","Profesional","Plazo indeterminado","2008-11-08",null,"1981-01-06","M","Local 3","Gerencia 1",6329,633]
["00003881","Córdoba García, Alicia María","Técnico","Plazo indeterminado","2008-12-12",null,"1978-12-13","F","Local 2","Gerencia 5",4663,420]
["00003892","Flores Salinas, Milagros Micaela","Profesional","Plazo indeterminado","2008-12-31",null,"1964-06-22","F","Local 1","Gerencia 1",6379,638]
["00003900","Salazar Espinosa, Mauricio Jesús","Ejecutivo","Plazo indeterminado","2009-02-09",null,"1981-08-18","M","Local 3","Gerencia 4",11055,1106]
["00003917","Cedeño Vázquez, Alejandro Marcelo","Ejecutivo","Plazo indeterminado","2009-02-20",null,"1975-01-11","M","Local 2","Gerencia 4",16441,1809]
["00003936","Jara Ramírez, Rodrigo Dylan","Profesional","Plazo indeterminado","2009-03-22",null,"1980-03-02","M","Local 1","Gerencia 1",6920,623]
["00003949","Quiroga Bravo, Luz Manuela","Técnico","Plazo indeterminado","2009-04-14",null,"1962-02-04","F","Local 2","Gerencia 4",5830,350]
["00003958","Olivares Jiménez, Fernanda Luz","Técnico","Plazo indeterminado","2009-04-14",null,"1966-11-04","F","Local 3","Gerencia 3",5603,448]
["00003973","Vera Lucero, Lucía Luisa","Profesional","Plazo indeterminado","2009-04-21",null,"1984-08-04","F","Local 1","Gerencia 5",8075,727]
["00003978","Vitale Hernández, Jerónimo Fabián","Técnico","Plazo indeterminado","2009-06-02",null,"1981-05-07","M","Local 3","Gerencia 4",5638,338]
["00003993","González Donoso, Carlos Bautista","Profesional","Plazo indeterminado","2009-07-05",null,"1975-07-02","M","Local 2","Gerencia 2",5507,441]
["00003999","Arce Espinosa, Rodrigo Maximiliano","Profesional","Plazo indeterminado","2009-07-06",null,"1983-10-25","M","Local 3","Gerencia 4",5619,562]
["00004016","Peña Sánchez, Miguel Jesús","Técnico","Plazo indeterminado","2009-07-16",null,"1971-05-22","M","Local 3","Gerencia 5",2818,282]
["00004033","Cáceres Castillo, Manuela Mabel","Técnico","Plazo indeterminado","2009-07-18",null,"1973-07-01","F","Local 3","Gerencia 4",5955,298]
["00004052","Salazar Moreno, Benjamín Gabriel","Profesional","Plazo indeterminado","2009-08-18",null,"1969-02-07","M","Local 3","Gerencia 2",9579,766]
["00004072","López Vera, Antonio Bernardo","Técnico","Plazo indeterminado","2009-09-12",null,"1967-07-09","M","Local 2","Gerencia 3",5615,393]
["00004088","Agüero Maldonado, Maya Nicole","Técnico","Plazo indeterminado","2009-09-16",null,"1979-05-28","F","Local 3","Gerencia 1",5259,473]
["00004096","Castillo Gutiérrez, Tomás Ricardo","Técnico","Plazo indeterminado","2009-10-22",null,"1981-02-02","M","Local 3","Gerencia 3",4022,362]
["00004108","Díaz Silva, Giovanna Elizabeth","Técnico","Plazo indeterminado","2009-10-29",null,"1968-05-28","F","Local 2","Gerencia 1",2977,149]
["00004113","Miranda Luna, Francisco Mario","Profesional","Plazo indeterminado","2009-10-30",null,"1968-03-29","M","Local 1","Gerencia 2",7399,666]
["00004125","Orellana García, Maximiliano","Profesional","Plazo indeterminado","2009-11-02",null,"1970-01-03","M","Local 1","Gerencia 4",6644,465]
["00004133","Jaramillo Hernández, Andrea Sara","Profesional","Plazo indeterminado","2009-11-18",null,"1975-05-21","F","Local 1","Gerencia 1",6754,405]
["00004141","Pérez Mendoza, César","Técnico","Plazo indeterminado","2009-12-29",null,"1980-10-26","M","Local 2","Gerencia 5",2806,140]
["00004150","Ramos Palma, Matías Salvador","Profesional","Plazo indeterminado","2010-01-01",null,"1978-07-14","M","Local 2","Gerencia 2",5775,289]
["00004169","Cárdenas Quispe, Agustín Bruno","Ejecutivo","Plazo indeterminado","2010-01-18",null,"1978-05-08","M","Local 1","Gerencia 2",16899,1521]
["00004182","Rodríguez Mamani, Ramona Lucía","Profesional","Plazo indeterminado","2010-02-14",null,"1971-03-17","F","Local 1","Gerencia 5",9063,544]
["00004201","Mendoza Flores, Agustín Gonzalo","Ejecutivo","Plazo indeterminado","2010-03-04",null,"1975-01-20","M","Local 3","Gerencia 5",20165,2621]
["00004219","Sanhueza Gómez, Mariana María","Profesional","Plazo indeterminado","2010-03-04",null,"1986-12-07","F","Local 2","Gerencia 3",8013,481]
["00004237","Navarro Silva, Héctor Salvador","Profesional","Plazo indeterminado","2010-03-23",null,"1974-02-28","M","Local 3","Gerencia 4",7877,473]
["00004250","Soria García, Ana Alessandra","Técnico","Plazo indeterminado","2010-04-19",null,"1980-08-15","F","Local 2","Gerencia 3",5645,339]
["00004269","Vera Acuña, Alondra Martina","Profesional","Plazo indeterminado","2010-04-22",null,"1987-04-20","F","Local 1","Gerencia 2",9583,575]
["00004285","Cárdenas Mamani, Abril Noemí","Profesional","Plazo indeterminado","2010-04-30",null,"1979-08-07","F","Local 1","Gerencia 4",8236,577]
["00004292","Jiménez Flores, Gonzalo Carlos","Técnico","Plazo indeterminado","2010-05-10",null,"1973-06-09","M","Local 2","Gerencia 2",3987,319]
["00004297","Ortega Mendoza, Andrea Maite","Ejecutivo","Plazo indeterminado","2010-05-13",null,"1971-08-10","F","Local 2","Gerencia 3",10354,1139]
["00004313","Herrera Hernández, Fabio Felipe","Ejecutivo","Plazo indeterminado","2010-05-13",null,"1969-09-17","M","Local 3","Gerencia 4",14913,1342]
["00004331","Mamani Maidana, Isidora Noemí","Ejecutivo","Plazo indeterminado","2010-06-17",null,"1980-01-27","F","Local 3","Gerencia 5",17248,2242]
["00004351","Álvarez Valenzuela, Mabel Paula","Técnico","Plazo indeterminado","2010-06-20",null,"1986-09-23","F","Local 2","Gerencia 2",5553,500]
["00004371","Paredes Quispe, Liz Carla","Técnico","Plazo indeterminado","2010-06-23",null,"1987-05-21","F","Local 2","Gerencia 1",5188,467]
["00004383","Martín Montenegro, Gabriela Julieta","Técnico","Plazo indeterminado","2010-07-08",null,"1982-02-07","F","Local 3","Gerencia 4",3230,258]
["00004389","Navarro Gómez, Franco Arturo","Profesional","Plazo indeterminado","2010-07-15",null,"1979-07-14","M","Local 2","Gerencia 2",7358,441]
["00004399","Reyes Ramos, Tomás Salvador","Profesional","Plazo indeterminado","2010-07-27",null,"1983-06-16","M","Local 2","Gerencia 3",9722,486]
["00004409","Quiroga Sánchez, David Ángel","Técnico","Plazo indeterminado","2010-08-13",null,"1965-11-30","M","Local 3","Gerencia 1",4798,288]
["00004425","Córdoba Lagos, Sofía Naomi","Técnico","Plazo indeterminado","2010-08-17",null,"1967-06-03","F","Local 3","Gerencia 1",3574,322]
["00004435","Ponce Vargas, Bruno Lucas","Técnico","Plazo indeterminado","2010-08-22",null,"1964-02-13","M","Local 3","Gerencia 2",4980,349]
["00004448","Sánchez Romero, Olivia Mia","Profesional","Plazo indeterminado","2010-09-03",null,"1986-01-31","F","Local 1","Gerencia 3",6370,382]
["00004465","Toro San Martín, Gabriela Nicole","Técnico","Plazo indeterminado","2010-09-12",null,"1970-08-30","F","Local 1","Gerencia 4",4298,301]
["00004475","Córdoba Garrido, Jerónimo Paolo","Profesional","Plazo indeterminado","2010-09-16",null,"1986-10-04","M","Local 2","Gerencia 5",5053,303]
["00004489","Cruz Poblete, Alessandra Natalia","Técnico","Plazo indeterminado","2010-09-26",null,"1978-09-13","F","Local 2","Gerencia 1",3787,379]
["00004500","Gómez Fermín, Alessandra Valentina","Técnico","Plazo indeterminado","2010-10-10",null,"1975-05-27","F","Local 2","Gerencia 4",4262,256]
["00004505","Moyano Rodríguez, Miguel Nicolás","Profesional","Plazo indeterminado","2010-10-23",null,"1979-12-07","M","Local 3","Gerencia 5",8259,661]
["00004513","Hernández Vidal, Luis Carlos","Profesional","Plazo indeterminado","2010-10-31",null,"1979-07-10","M","Local 3","Gerencia 4",5209,313]
["00004528","Aguilera Salazar, Martín Dylan","Profesional","Plazo indeterminado","2010-11-10",null,"1980-08-09","M","Local 3","Gerencia 1",5072,254]
["00004535","Vázquez Vergara, Julia Sofía","Técnico","Plazo indeterminado","2010-12-03",null,"1970-08-01","F","Local 2","Gerencia 4",5485,439]
["00004546","Espinosa Ponce, Milagros Antonella","Técnico","Plazo indeterminado","2010-12-06",null,"1983-02-11","F","Local 2","Gerencia 4",3110,156]
["00004551","Flores Quiroga, Tomás Héctor","Ejecutivo","Plazo indeterminado","2010-12-11",null,"1975-11-09","M","Local 3","Gerencia 4",15035,1203]
["00004557","Mamani Soto, Samantha Valentina","Ejecutivo","Plazo indeterminado","2011-01-26",null,"1986-07-11","F","Local 2","Gerencia 3",18673,2054]
["00004573","Morales Navarro, Antonio Bernardo","Técnico","Plazo indeterminado","2011-01-26",null,"1983-09-06","M","Local 2","Gerencia 2",3859,270]
["00004583","Herrera Soto, Luisa Beatriz","Técnico","Plazo indeterminado","2011-02-27",null,"1966-11-22","F","Local 1","Gerencia 1",3621,326]
["00004599","González Tapia, Matías Fabio","Técnico","Plazo indeterminado","2011-03-09",null,"1976-08-12","M","Local 1","Gerencia 2",5163,516]
["00004606","Ramírez Sosa, Vicente Hugo","Profesional","Plazo indeterminado","2011-03-10",null,"1975-04-14","M","Local 3","Gerencia 2",9356,842]
["00004614","Venegas Salazar, Paula Isabella","Ejecutivo","Plazo indeterminado","2011-03-20",null,"1974-07-10","F","Local 1","Gerencia 2",20935,1884]
["00004624","Torres Silva, Benjamín Rafael","Ejecutivo","Plazo indeterminado","2011-03-29",null,"1979-06-16","M","Local 2","Gerencia 4",17596,1936]
["00004635","Navarrete Ruiz, Andrea Luciana","Alta Gerencia","Plazo indeterminado","2011-04-02",null,"1983-06-17","F","Local 1","Gerencia 4",31614,4742]
["00004655","Fernández Díaz, Abigail Elizabeth","Ejecutivo","Plazo indeterminado","2011-04-11",null,"1983-12-02","F","Local 1","Gerencia 1",19252,1925]
["00004662","Valdez Pereyra, Paolo Alejandro","Profesional","Plazo indeterminado","2011-04-11",null,"1971-08-23","M","Local 3","Gerencia 5",5893,413]
["00004676","López Ruiz, Francisco Alonso","Técnico","Plazo indeterminado","2011-04-14",null,"1969-12-23","M","Local 1","Gerencia 2",4442,311]
["00004692","González Velázquez, Miguel Felipe","Profesional","Plazo indeterminado","2011-05-06",null,"1986-06-10","M","Local 1","Gerencia 4",6696,670]
["00004704","Jaramillo Peña, Franco Ricardo","Técnico","Plazo indeterminado","2011-05-18",null,"1971-05-20","M","Local 1","Gerencia 4",5928,296]
["00004717","Hernández Yáñez, Javier Renzo","Profesional","Plazo indeterminado","2011-06-05",null,"1985-01-12","M","Local 2","Gerencia 1",6505,520]
["00004730","Lucero Alvarado, César Franco","Profesional","Plazo indeterminado","2011-06-11",null,"1968-12-17","M","Local 2","Gerencia 3",5671,567]
["00004742","Olivera Romero, Franco César","Profesional","Plazo indeterminado","2011-06-13",null,"1980-07-02","M","Local 3","Gerencia 4",5258,368]
["00004751","Pizarro Saavedra, Santiago Carlos","Técnico","Plazo indeterminado","2011-06-23",null,"1973-10-21","M","Local 2","Gerencia 3",4953,495]
["00004763","Juárez Campos, Mabel Valentina","Técnico","Plazo indeterminado","2011-07-16",null,"1977-08-06","F","Local 3","Gerencia 1",3792,228]
["00004783","Barrios Navarro, Mateo","Profesional","Plazo indeterminado","2011-07-29",null,"1984-07-11","M","Local 2","Gerencia 2",7649,459]
["00004795","Rodríguez Espinosa, Dylan Fabio","Profesional","Plazo indeterminado","2011-09-19",null,"1975-01-13","M","Local 2","Gerencia 4",5914,296]
["00004815","Luna Flores, Joaquín Rafael","Profesional","Plazo indeterminado","2011-09-25",null,"1986-07-19","M","Local 2","Gerencia 5",9147,640]
["00004828","González Velázquez, Alonso Ramón","Profesional","Plazo indeterminado","2011-09-29",null,"1974-07-16","M","Local 2","Gerencia 4",8933,536]
["00004838","Olivera Fernández, Ariana Zoe","Técnico","Plazo indeterminado","2011-11-08",null,"1979-11-28","F","Local 3","Gerencia 3",2968,297]
["00004851","Poblete Flores, Ramón David","Técnico","Plazo indeterminado","2012-01-15",null,"1969-09-28","M","Local 3","Gerencia 2",4083,367]
["00004856","Vásquez Ortiz, Natalia Mia","Ejecutivo","Plazo indeterminado","2012-02-28",null,"1970-11-17","F","Local 1","Gerencia 1",18151,1815]
["00004869","Romero Ruiz, Laura Camila","Ejecutivo","Plazo indeterminado","2012-03-27",null,"1978-09-15","F","Local 3","Gerencia 4",20112,2413]
["00004874","Castro Gómez, Ian Pedro","Técnico","Plazo indeterminado","2012-04-05",null,"1971-02-23","M","Local 1","Gerencia 4",4811,289]
["00004880","Ramos Donoso, Ximena Ramona","Técnico","Plazo indeterminado","2012-04-21",null,"1973-01-17","F","Local 1","Gerencia 5",4977,448]
["00004889","Molina Acosta, Alonso José","Profesional","Plazo indeterminado","2012-04-28",null,"1986-09-24","M","Local 3","Gerencia 3",5448,272]
["00004901","Parra Rodríguez, Fernanda Martina","Profesional","Plazo indeterminado","2012-05-08",null,"1975-09-26","F","Local 2","Gerencia 2",8793,791]
["00004907","Maldonado Sáez, Ian Ricardo","Ejecutivo","Plazo indeterminado","2012-06-25",null,"1970-10-30","M","Local 2","Gerencia 3",18868,2264]
["00004922","Vitale Godoy, Diego Daniel","Profesional","Plazo indeterminado","2012-07-19",null,"1977-05-17","M","Local 2","Gerencia 5",5934,593]
["00004927","García Benítez, Fabio","Profesional","Plazo indeterminado","2012-07-19",null,"1987-03-04","M","Local 3","Gerencia 3",7016,561]
["00004942","Navarrete Flores, Gabriela Lucía","Técnico","Plazo indeterminado","2012-08-14",null,"1985-06-01","F","Local 1","Gerencia 2",2846,142]
["00004950","Vargas Contreras, Salvador Felipe","Ejecutivo","Plazo indeterminado","2012-08-19",null,"1975-03-12","M","Local 1","Gerencia 2",12810,1153]
["00004964","Pérez Navarro, Antonio Lucas","Técnico","Plazo indeterminado","2012-08-27",null,"1982-09-17","M","Local 1","Gerencia 4",3219,258]
["00004969","Álvarez Salazar, Marco Pablo","Profesional","Plazo indeterminado","2012-09-07",null,"1988-09-18","M","Local 1","Gerencia 5",8043,402]
["00004984","Mendoza Mamani, Bautista Miguel","Profesional","Plazo indeterminado","2012-09-19",null,"1989-03-14","M","Local 3","Gerencia 4",6984,629]
["00004994","Pino Sánchez, Dylan Bernardo","Ejecutivo","Plazo indeterminado","2012-09-28",null,"1987-05-21","M","Local 3","Gerencia 5",21231,2548]
["00005002","Fermín González, Agustina Isabella","Técnico","Plazo indeterminado","2012-09-30",null,"1966-07-07","F","Local 2","Gerencia 4",3355,201]
["00005012","Gutiérrez Ramos, Liz Sofía","Profesional","Plazo indeterminado","2012-10-31",null,"1972-05-28","F","Local 1","Gerencia 1",8816,617]
["00005026","Flores Vázquez, Jesús Juan","Ejecutivo","Plazo indeterminado","2012-11-16",null,"1976-11-09","M","Local 3","Gerencia 5",12345,1605]
["00005041","García Jara, Carolina Maya","Técnico","Plazo indeterminado","2012-12-10",null,"1985-06-06","F","Local 1","Gerencia 3",3802,304]
["00005055","Franco Ferreyra, Mauricio Nicolás","Profesional","Plazo indeterminado","2012-12-22",null,"1974-02-28","M","Local 3","Gerencia 4",5511,441]
["00005060","Quispe Castillo, Rodrigo Renzo","Profesional","Plazo indeterminado","2013-01-08",null,"1987-05-15","M","Local 2","Gerencia 5",7695,539]
["00005065","Vargas Henríquez, Valentina Zoe","Técnico","Plazo indeterminado","2013-03-01",null,"1990-07-09","F","Local 3","Gerencia 3",5520,442]
["00005075","Ojeda Franco, Daniel Rodrigo","Profesional","Plazo indeterminado","2013-04-04",null,"1970-05-12","M","Local 3","Gerencia 1",7123,499]
["00005086","Agüero Sánchez, Abigail Josefa","Profesional","Plazo indeterminado","2013-05-23",null,"1966-10-03","F","Local 1","Gerencia 5",5015,251]
["00005095","Jiménez Vidal, Pablo Nicolás","Alta Gerencia","Plazo indeterminado","2013-06-06",null,"1977-01-07","M","Local 1","Gerencia 5",34073,4089]
["00005109","Pizarro Navarro, Lucía Emilia","Técnico","Plazo indeterminado","2013-06-07",null,"1971-11-09","F","Local 2","Gerencia 3",5725,401]
["00005123","Ortiz Farías, Benjamín Renzo","Ejecutivo","Plazo indeterminado","2013-06-09",null,"1974-02-19","M","Local 3","Gerencia 5",18483,2033]
["00005138","Vera Hernández, Ariana Josefa","Profesional","Plazo indeterminado","2013-06-12",null,"1990-02-28","F","Local 1","Gerencia 3",5770,289]
["00005146","Henríquez Quispe, Jesús Mateo","Profesional","Plazo indeterminado","2013-07-10",null,"1980-07-16","M","Local 2","Gerencia 5",6303,504]
["00005153","Cardozo Miranda, Mariana Isabella","Técnico","Plazo indeterminado","2013-07-21",null,"1986-01-12","F","Local 3","Gerencia 1",4608,230]
["00005162","Vargas Hernández, Bernardo Ignacio","Ejecutivo","Plazo indeterminado","2013-08-02",null,"1972-09-25","M","Local 1","Gerencia 1",20986,2728]
["00005170","Peña Salinas, Franco Miguel","Ejecutivo","Plazo indeterminado","2013-09-09",null,"1975-06-29","M","Local 1","Gerencia 2",19684,2559]
["00005180","Ramírez Rojas, Gabriel Mario","Profesional","Plazo indeterminado","2013-09-12",null,"1979-06-28","M","Local 2","Gerencia 2",6501,390]
["00005195","Agüero Ferreyra, Benjamín Diego","Técnico","Plazo indeterminado","2013-09-17",null,"1976-01-15","M","Local 3","Gerencia 5",4316,388]
["00005201","Sandoval García, Micaela Andrea","Técnico","Plazo indeterminado","2013-09-23",null,"1982-08-09","F","Local 3","Gerencia 3",3040,213]
["00005212","Olivera Páez, Carlos Iker","Profesional","Plazo indeterminado","2013-10-08",null,"1977-12-22","M","Local 3","Gerencia 5",6021,361]
["00005220","Venegas Hernández, Ángel Samuel","Profesional","Plazo indeterminado","2013-10-18",null,"1961-10-20","M","Local 1","Gerencia 3",9192,735]
["00005235","Mamani Sánchez, Mario Mateo","Profesional","Plazo indeterminado","2013-11-17",null,"1976-07-22","M","Local 2","Gerencia 5",5116,512]
["00005245","Mamani Gómez, Marco Matías","Profesional","Plazo indeterminado","2013-11-23",null,"1965-12-08","M","Local 3","Gerencia 4",7564,681]
["00005254","Martínez Aguirre, Antonio André","Técnico","Plazo indeterminado","2013-11-27",null,"1975-09-24","M","Local 2","Gerencia 3",3295,264]
["00005265","Castillo Leiva, Maite Ariana","Técnico","Plazo indeterminado","2013-12-25",null,"1986-05-23","F","Local 3","Gerencia 4",5386,539]
["00005278","Ramos Silva, Tomás Lucas","Profesional","Plazo indeterminado","2014-01-05",null,"1973-05-22","M","Local 1","Gerencia 2",5416,542]
["00005290","Rodríguez Alonso, Emma Raquel","Técnico","Plazo indeterminado","2014-01-06",null,"1971-06-01","F","Local 3","Gerencia 1",5885,471]
["00005305","Vázquez Ríos, Vicente Arturo","Técnico","Plazo indeterminado","2014-02-03",null,"1984-08-26","M","Local 2","Gerencia 5",5915,592]
["00005311","Muñoz García, Diego Thiago","Técnico","Plazo indeterminado","2014-03-01",null,"1990-01-19","M","Local 3","Gerencia 3",3072,154]
["00005321","Díaz Toro, Ricardo Marcelo","Ejecutivo","Plazo indeterminado","2014-03-09",null,"1978-06-27","M","Local 1","Gerencia 1",20977,1678]
["00005331","Reyes Vidal, Samuel Arturo","Profesional","Plazo indeterminado","2014-03-12",null,"1990-04-20","M","Local 1","Gerencia 5",7660,766]
["00005339","Vásquez Torres, Salvador Ian","Técnico","Plazo indeterminado","2014-03-17",null,"1973-07-15","M","Local 2","Gerencia 4",5071,507]
["00005352","Gómez Leiva, Jesús Benjamín","Profesional","Plazo indeterminado","2014-03-23",null,"1972-06-22","M","Local 2","Gerencia 1",9175,642]
["00005367","Suárez Chávez, André Agustín","Profesional","Plazo indeterminado","2014-04-28",null,"1979-09-03","M","Local 2","Gerencia 5",7439,521]
["00005376","Barrios Martín, Beatriz Micaela","Técnico","Plazo indeterminado","2014-04-30",null,"1986-07-16","F","Local 3","Gerencia 4",3773,226]
["00005387","Álvarez Ramírez, Jesús Samuel","Profesional","Plazo indeterminado","2014-05-19",null,"1967-10-29","M","Local 2","Gerencia 1",7620,381]
["00005392","Toro Martínez, Olivia Giovanna","Técnico","Plazo indeterminado","2014-06-08",null,"1969-07-19","F","Local 1","Gerencia 3",4141,373]
["00005403","Castro Moreno, María Alicia","Técnico","Plazo fijo","2014-07-02","2015-06-27","1977-03-21","F","Local 1","Gerencia 3",4187,419]
["00005416","Guzmán Díaz, Vicente Gabriel","Profesional","Plazo indeterminado","2014-07-04",null,"1974-06-14","M","Local 2","Gerencia 1",5660,566]
["00005431","Rojas Vázquez, Pablo Bruno","Técnico","Plazo fijo","2014-07-07","2015-07-02","1971-01-09","M","Local 1","Gerencia 4",3899,234]
["00005437","Carvajal Jiménez, Lucas Ángel","Técnico","Plazo fijo","2014-07-09","2015-07-04","1962-07-13","M","Local 1","Gerencia 4",5890,412]
["00005443","Medina Moreno, Tomás Adrián","Profesional","Plazo fijo","2014-07-22","2015-07-17","1980-04-23","M","Local 1","Gerencia 1",9879,790]
["00005451","Mansilla Quispe, Bernardo Ángel","Técnico","Plazo fijo","2014-08-02","2015-07-28","1980-06-24","M","Local 1","Gerencia 4",5579,558]
["00005458","Jiménez Farías, Maximiliano David","Técnico","Plazo fijo","2014-08-19","2015-08-14","1980-06-26","M","Local 1","Gerencia 1",3802,266]
["00005469","Chávez Vera, Salvador David","Técnico","Plazo fijo","2014-08-20","2015-08-15","1966-08-09","M","Local 1","Gerencia 3",4092,246]
["00005482","Quispe Espinosa, Mateo Maximiliano","Técnico","Plazo fijo","2014-08-21","2015-08-16","1977-01-31","M","Local 1","Gerencia 3",5291,265]
["00005490","Mendoza Castro, Mario Nicolás","Profesional","Plazo indeterminado","2014-09-06",null,"1972-04-14","M","Local 2","Gerencia 3",9366,843]
["00005504","Quispe Mendoza, Luis Jesús","Técnico","Plazo fijo","2014-09-06","2015-09-01","1968-11-18","M","Local 1","Gerencia 4",3051,153]
["00005509","Rodríguez Núñez, Marco Diego","Técnico","Plazo fijo","2014-09-12","2015-09-07","1977-07-14","M","Local 1","Gerencia 3",4422,310]
["00005515","Sánchez Godoy, Fabio Mario","Técnico","Plazo indeterminado","2014-09-20",null,"1970-05-28","M","Local 2","Gerencia 2",3571,179]
["00005526","Castillo Ruiz, Liz Mabel","Técnico","Plazo fijo","2014-09-29","2015-09-24","1966-02-02","F","Local 1","Gerencia 1",4097,328]
["00005536","Carrasco Quispe, Laura Naomi","Técnico","Plazo indeterminado","2014-10-01",null,"1969-02-25","F","Local 3","Gerencia 3",5164,516]
["00005546","Ramírez Carrasco, Camila María","Técnico","Plazo fijo","2014-10-07","2015-10-02","1978-05-31","F","Local 1","Gerencia 5",3576,250]
["00005560","Fermín González, Natalia Alma","Profesional","Plazo fijo","2014-10-14","2015-10-09","1969-07-24","F","Local 1","Gerencia 2",5359,375]
["00005570","Vera Poblete, Luis Felipe","Profesional","Plazo fijo","2014-10-18","2015-10-13","1980-08-18","M","Local 1","Gerencia 4",9074,907]
["00005585","Cedeño Muñoz, Manuela Liz","Técnico","Plazo fijo","2014-10-24","2015-10-19","1982-09-29","F","Local 1","Gerencia 1",4253,213]
["00005592","Ramos Ortiz, Alexander David","Profesional","Plazo fijo","2014-11-01","2015-10-27","1984-05-06","M","Local 1","Gerencia 3",9358,936]
["00005606","Romero Contreras, Miguel","Profesional","Plazo fijo","2014-11-06","2015-11-01","1975-09-02","M","Local 1","Gerencia 3",8593,602]
["00005613","Castro Sánchez, Emilia Alexandra","Profesional","Plazo fijo","2014-11-06","2015-11-01","1974-05-09","F","Local 1","Gerencia 5",8753,875]
["00005628","Navarrete Molina, Valeria Zoe","Técnico","Plazo fijo","2014-11-07","2015-11-02","1980-07-27","F","Local 1","Gerencia 5",4662,373]
["00005634","Fermín Bustos, Olivia Salomé","Técnico","Plazo fijo","2014-11-09","2015-11-04","1972-05-11","F","Local 1","Gerencia 2",3670,294]
["00005641","Gutiérrez Domínguez, Sofía Alma","Técnico","Plazo fijo","2014-11-11","2015-11-06","1966-04-12","F","Local 1","Gerencia 5",5819,291]
["00005653","Juárez San Martín, Fabio Mariano","Técnico","Plazo fijo","2014-11-15","2015-11-10","1966-05-22","M","Local 1","Gerencia 5",4828,386]
["00005662","Carrasco Leiva, Daniela Sofía","Profesional","Plazo fijo","2014-11-17","2015-11-12","1974-04-02","F","Local 1","Gerencia 4",5648,508]
["00005673","Mendoza Moreno, Nicole Noemí","Técnico","Plazo fijo","2014-11-22","2015-11-17","1961-04-21","F","Local 1","Gerencia 4",3667,220]
["00005685","Cabrera Rodríguez, Isidora Abigail","Profesional","Plazo fijo","2014-11-24","2015-11-19","1982-08-13","F","Local 1","Gerencia 1",7667,613]
["00005698","Chávez Juárez, Daniel Samuel","Técnico","Plazo fijo","2014-12-10","2015-12-05","1973-04-20","M","Local 1","Gerencia 3",3145,157]
["00005710","Romero Venegas, Concepción Abigail","Técnico","Plazo fijo","2014-12-10","2015-12-05","1977-11-14","F","Local 1","Gerencia 2",4001,400]
["00005720","Domínguez Ponce, Pedro Mario","Técnico","Plazo fijo","2014-12-21","2015-12-16","1981-09-05","M","Local 1","Gerencia 5",5595,392]
["00005728","Alarcón Poblete, Gonzalo Nicolás","Profesional","Plazo fijo","2014-12-23","2015-12-18","1973-09-12","M","Local 1","Gerencia 2",6468,453]
["00005738","Méndez Rodríguez, Emilia Julieta","Técnico","Plazo fijo","2015-01-07","2016-01-02","1981-01-22","F","Local 1","Gerencia 2",5992,479]
["00005750","Sanhueza Cardozo, Nicolás Lucas","Practicante","Plazo fijo","2015-01-21","2015-07-20","1993-02-19","M","Local 1","Gerencia 2",1752,0]
["00005758","Godoy Riquelme, Alexandra Giovanna","Practicante","Plazo fijo","2015-01-21","2015-07-20","1994-09-24","F","Local 2","Gerencia 4",1547,0]
["00005772","Díaz Gutiérrez, Isabella Raquel","Practicante","Plazo fijo","2015-01-23","2015-07-22","1989-11-04","F","Local 3","Gerencia 3",1928,0]
["00005780","Gómez Coronel, Fernanda Beatriz","Practicante","Plazo fijo","2015-01-24","2015-07-23","1990-12-03","F","Local 3","Gerencia 4",1877,0]
["00005788","Moreno Ramírez, Diego Salvador","Técnico","Plazo fijo","2015-01-25","2016-01-20","1985-01-13","M","Local 1","Gerencia 1",4008,281]
["00005800","Núñez Hernández, Antonio Nicolás","Practicante","Plazo fijo","2015-01-26","2015-07-25","1990-03-26","M","Local 1","Gerencia 1",1745,0]
["00005813","Gómez Castillo, Isabella Gabriela","Profesional","Plazo fijo","2015-01-27","2016-01-22","1978-01-28","F","Local 1","Gerencia 2",8427,506]
["00005822","Sáez Ruiz, Lucas Thiago","Practicante","Plazo fijo","2015-01-30","2015-07-29","1994-02-26","M","Local 1","Gerencia 3",1744,0]
["00005829","Castro Ferreyra, Ximena Raquel","Técnico","Plazo fijo","2015-01-31","2016-01-26","1968-02-15","F","Local 1","Gerencia 1",5415,271]
["00005834","Chávez Velázquez, Noemí Victoria","Técnico","Plazo fijo","2015-01-31","2016-01-26","1983-06-12","F","Local 1","Gerencia 2",3495,350]
["00005848","Sandoval Pérez, Giovanna Ana","Profesional","Plazo fijo","2015-02-06","2016-02-01","1968-10-27","F","Local 1","Gerencia 5",6314,505]
["00005855","López Figueroa, Mabel Sarah","Técnico","Plazo fijo","2015-02-06","2016-02-01","1964-12-05","F","Local 1","Gerencia 2",3852,193]
["00005870","Lagos Álvarez, Micaela Agustina","Practicante","Plazo fijo","2015-02-13","2015-08-12","1994-06-16","F","Local 2","Gerencia 2",1505,0]
["00005883","Ramos Contreras, David Gonzalo","Técnico","Plazo fijo","2015-02-13","2016-02-08","1978-09-01","M","Local 1","Gerencia 5",2891,173]
["00005898","Jiménez Navarro, Rafael Antonio","Practicante","Plazo fijo","2015-02-23","2015-08-22","1992-12-01","M","Local 2","Gerencia 5",1638,0]
["00005911","Aguilera Sáez, Agustín Franco","Técnico","Plazo fijo","2015-02-26","2016-02-21","1985-09-14","M","Local 1","Gerencia 2",5534,443]
["00005924","Gómez Ramos, Rafael Alejandro","Técnico","Plazo fijo","2015-03-01","2016-02-24","1975-01-20","M","Local 1","Gerencia 1",2886,173]
["00005930","Sáez Huamán, Héctor Ramón","Técnico","Plazo fijo","2015-03-02","2016-02-25","1969-07-21","M","Local 1","Gerencia 4",5189,363]
["00005942","Sosa Godoy, Amanda Ariana","Profesional","Plazo fijo","2015-03-05","2016-02-28","1970-06-29","F","Local 1","Gerencia 4",7373,590]
["00005949","Carvajal Ponce, Liz Naomi","Profesional","Plazo fijo","2015-03-13","2016-03-07","1967-02-07","F","Local 1","Gerencia 5",5295,424]
["00005954","Correa Cruz, Beatriz Alicia","Técnico","Plazo fijo","2015-03-18","2016-03-12","1982-07-13","F","Local 1","Gerencia 3",3132,313]
["00005966","Rodríguez Acuña, Bautista Ángel","Profesional","Plazo fijo","2015-03-24","2016-03-18","1974-06-28","M","Local 1","Gerencia 3",9726,973]
["00005979","Ferreyra Vera, Zoe María","Profesional","Plazo fijo","2015-03-25","2016-03-19","1985-04-21","F","Local 1","Gerencia 1",9913,496]

{"sheet":"Ejemplo sin macros","index":1,"n_rows":32,"n_cols":13,"rows_kept":32,"cut":false,"hidden":false,"merged":[]}
[null,"Datos de Trabajadores"]
[]
[]
[null,"Código","Apellidos, Nombres","Cargo","Monto","Fecha Nacimiento","Sexo","Local","Centro de Costo","Condición"]
[null,"00002019","vasda",{"$f":"VLOOKUP('BD Personal'!B17,'BD Personal'!$B$2:$L$401,2,FALSE)","v":"Profesional"},{"$f":"VLOOKUP('BD Personal'!B17,'BD Personal'!$B$2:$L$401,4,FALSE)","v":34588},{"$f":"VLOOKUP('BD Personal'!$B17,'BD Personal'!$B$2:$L$401,6,FALSE)","v":"1970-11-15"},{"$f":"VLOOKUP('BD Personal'!$B17,'BD Personal'!$B$2:$L$401,7,FALSE)","v":"M"},{"$f":"VLOOKUP('BD Personal'!$B17,'BD Personal'!$B$2:$L$401,8,FALSE)","v":"Local 3"},{"$f":"IFERROR(VLOOKUP('BD Personal'!$B17,'BD Personal'!$B$2:$L$401,99,FALSE), \"Errado\")","v":"Errado"},{"$f":"IFERROR(E5>=35000,\" \")","v":false},null,"Función II: Verificar Fórmulas"]
[null,"00002851",{"$f":"VLOOKUP('BD Personal'!B29,'BD Personal'!B29:L428,1,FALSE)","v":"Cortés Quispe, Héctor Samuel"},{"$f":"VLOOKUP('BD Personal'!B29,'BD Personal'!$B$2:$L$401,2,FALSE)","v":"Profesional"},{"$f":"VLOOKUP('BD Personal'!B29,'BD Personal'!$B$2:$L$401,4,FALSE)","v":35506},{"$f":"VLOOKUP('BD Personal'!$B29,'BD Personal'!$B$2:$L$401,6,FALSE)","v":"1973-09-16"},{"$f":"VLOOKUP('BD Personal'!$B29,'BD Personal'!$B$2:$L$401,7,FALSE)","v":"M"},{"$f":"VLOOKUP('BD Personal'!$B29,'BD Personal'!$B$2:$L$401,8,FALSE)","v":"Local 3"},{"$f":"VLOOKUP('BD Personal'!$B29,'BD Personal'!$B$2:$L$401,9,FALSE)","v":"Gerencia 1"},{"$f":"IFERROR(E6>=35000,\" \")","v":true}]
[null,"00000536",{"$f":"VLOOKUP('BD Personal'!B3,'BD Personal'!B3:L402,1,FALSE)","v":"Díaz García, Alexander Pedro"},{"$f":"VLOOKUP('BD Personal'!B3,'BD Personal'!$B$2:$L$401,2,FALSE)","v":"Profesional"},{"$f":"VLOOKUP('BD Personal'!B3,'BD Personal'!$B$2:$L$401,4,FALSE)","v":31630},{"$f":"VLOOKUP('BD Personal'!$B3,'BD Personal'!$B$2:$L$401,6,FALSE)","v":"1962-12-05"},{"$f":"VLOOKUP('BD Personal'!$B3,'BD Personal'!$B$2:$L$401,7,FALSE)","v":"M"},{"$f":"VLOOKUP('BD Personal'!$B3,'BD Personal'!$B$2:$L$401,8,FALSE)","v":"Local 1"},{"$f":"VLOOKUP('BD Personal'!$B3,'BD Personal'!$B$2:$L$401,9,FALSE)","v":"Gerencia General"},{"$f":"IFERROR(E7>=35000,\" \")","v":false}]
[null,"00002311",{"$f":"VLOOKUP('BD Personal'!B20,'BD Personal'!B20:L419,1,FALSE)","v":"Díaz Luna, Abril Maite"},{"$f":"VLOOKUP('BD Personal'!B20,'BD Personal'!$B$2:$L$401,2,FALSE)","v":"Técnico"},{"$f":"VLOOKUP('BD Personal'!B20,'BD Personal'!$B$2:$L$401,4,FALSE)","v":34894},{"$f":"VLOOKUP('BD Personal'!$B20,'BD Personal'!$B$2:$L$401,6,FALSE)","v":"1968-03-20"},{"$f":"VLOOKUP('BD Personal'!$B20,'BD Personal'!$B$2:$L$401,7,FALSE)","v":"F"},{"$f":"VLOOKUP('BD Personal'!$B20,'BD Personal'!$B$2:$L$401,8,FALSE)","v":"Local 3"},{"$f":"VLOOKUP('BD Personal'!$B20,'BD Personal'!$B$2:$L$401,9,FALSE)","v":"Gerencia 2"},{"$f":"IFERROR(E8>=35000,\" \")","v":false}]
[null,"00001803",{"$f":"VLOOKUP('BD Personal'!B11,'BD Personal'!B11:L410,1,FALSE)","v":"Díaz Saavedra, Álvaro Marcelo"},{"$f":"VLOOKUP('BD Personal'!B11,'BD Personal'!$B$2:$L$401,2,FALSE)","v":"Técnico"},{"$f":"VLOOKUP('BD Personal'!B11,'BD Personal'!$B$2:$L$401,4,FALSE)","v":34086},{"$f":"VLOOKUP('BD Personal'!$B11,'BD Personal'!$B$2:$L$401,6,FALSE)","v":"1963-12-13"},{"$f":"VLOOKUP('BD Personal'!$B11,'BD Personal'!$B$2:$L$401,7,FALSE)","v":"M"},{"$f":"VLOOKUP('BD Personal'!$B11,'BD Personal'!$B$2:$L$401,8,FALSE)","v":"Local 2"},{"$f":"VLOOKUP('BD Personal'!$B11,'BD Personal'!$B$2:$L$401,9,FALSE)","v":"Gerencia 5"},{"$f":"IFERROR(E9>=35000,\" \")","v":false}]
[null,"00002367",{"$f":"VLOOKUP('BD Personal'!B21,'BD Personal'!B21:L420,1,FALSE)","v":"Domínguez Castillo, Mario Bautista"},{"$f":"VLOOKUP('BD Personal'!B21,'BD Personal'!$B$2:$L$401,2,FALSE)","v":"Profesional"},{"$f":"VLOOKUP('BD Personal'!B21,'BD Personal'!$B$2:$L$401,4,FALSE)","v":34937},{"$f":"VLOOKUP('BD Personal'!$B21,'BD Personal'!$B$2:$L$401,6,FALSE)","v":"1963-07-25"},{"$f":"VLOOKUP('BD Personal'!$B21,'BD Personal'!$B$2:$L$401,7,FALSE)","v":"M"},{"$f":"VLOOKUP('BD Personal'!$B21,'BD Personal'!$B$2:$L$401,8,FALSE)","v":"Local 3"},{"$f":"VLOOKUP('BD Personal'!$B21,'BD Personal'!$B$2:$L$401,9,FALSE)","v":"Gerencia 2"},{"$f":"IFERROR(E10>=35000,\" \")","v":false}]
[null,"00001749",{"$f":"VLOOKUP('BD Personal'!B10,'BD Personal'!B10:L409,1,FALSE)","v":"Espinosa Ferreyra, José Fabricio"},{"$f":"VLOOKUP('BD Personal'!B10,'BD Personal'!$B$2:$L$401,2,FALSE)","v":"Profesional"},{"$f":"VLOOKUP('BD Personal'!B10,'BD Personal'!$B$2:$L$401,4,FALSE)","v":33912},{"$f":"VLOOKUP('BD Personal'!$B10,'BD Personal'!$B$2:$L$401,6,FALSE)","v":"1967-12-22"},{"$f":"VLOOKUP('BD Personal'!$B10,'BD Personal'!$B$2:$L$401,7,FALSE)","v":"M"},{"$f":"VLOOKUP('BD Personal'!$B10,'BD Personal'!$B$2:$L$401,8,FALSE)","v":"Local 3"},{"$f":"VLOOKUP('BD Personal'!$B10,'BD Personal'!$B$2:$L$401,9,FALSE)","v":"Gerencia 2"},{"$f":"IFERROR(E11>=35000,\" \")","v":false},null,null,"Función I: Condición"]
[null,"00000965",{"$f":"VLOOKUP('BD Personal'!B4,'BD Personal'!B4:L403,1,FALSE)","v":"Farías Rodríguez, Santiago Dylan"},{"$f":"VLOOKUP('BD Personal'!B4,'BD Personal'!$B$2:$L$401,2,FALSE)","v":"Técnico"},{"$f":"VLOOKUP('BD Personal'!B4,'BD Personal'!$B$2:$L$401,4,FALSE)","v":32327},{"$f":"VLOOKUP('BD Personal'!$B4,'BD Personal'!$B$2:$L$401,6,FALSE)","v":"1962-09-21"},{"$f":"VLOOKUP('BD Personal'!$B4,'BD Personal'!$B$2:$L$401,7,FALSE)","v":"M"},{"$f":"VLOOKUP('BD Personal'!$B4,'BD Personal'!$B$2:$L$401,8,FALSE)","v":"Local 2"},{"$f":"VLOOKUP('BD Personal'!$B4,'BD Personal'!$B$2:$L$401,9,FALSE)","v":"Gerencia 3"},{"$f":"IFERROR(E12>=35000,\" \")","v":false}]
[null,"00001872",{"$f":"VLOOKUP('BD Personal'!B13,'BD Personal'!B13:L412,1,FALSE)","v":"Flores Miranda, Daniela Ramona"},{"$f":"VLOOKUP('BD Personal'!B13,'BD Personal'!$B$2:$L$401,2,FALSE)","v":"Profesional"},{"$f":"VLOOKUP('BD Personal'!B13,'BD Personal'!$B$2:$L$401,4,FALSE)","v":34338},{"$f":"VLOOKUP('BD Personal'!$B13,'BD Personal'!$B$2:$L$401,6,FALSE)","v":"1968-01-03"},{"$f":"VLOOKUP('BD Personal'!$B13,'BD Personal'!$B$2:$L$401,7,FALSE)","v":"F"},{"$f":"VLOOKUP('BD Personal'!$B13,'BD Personal'!$B$2:$L$401,8,FALSE)","v":"Local 2"},{"$f":"VLOOKUP('BD Personal'!$B13,'BD Personal'!$B$2:$L$401,9,FALSE)","v":"Gerencia 2"},{"$f":"IFERROR(E13>=35000,\" \")","v":false}]
[null,"00002588",{"$f":"VLOOKUP('BD Personal'!B25,'BD Personal'!B25:L424,1,FALSE)","v":"Herrera Guerrero, Alexander Francisco"},{"$f":"VLOOKUP('BD Personal'!B25,'BD Personal'!$B$2:$L$401,2,FALSE)","v":"Profesional"},{"$f":"VLOOKUP('BD Personal'!B25,'BD Personal'!$B$2:$L$401,4,FALSE)","v":35224},{"$f":"VLOOKUP('BD Personal'!$B25,'BD Personal'!$B$2:$L$401,6,FALSE)","v":"1972-03-07"},{"$f":"VLOOKUP('BD Personal'!$B25,'BD Personal'!$B$2:$L$401,7,FALSE)","v":"M"},{"$f":"VLOOKUP('BD Personal'!$B25,'BD Personal'!$B$2:$L$401,8,FALSE)","v":"Local 3"},{"$f":"VLOOKUP('BD Personal'!$B25,'BD Personal'!$B$2:$L$401,9,FALSE)","v":"Gerencia 5"},{"$f":"IFERROR(E14>=35000,\" \")","v":true}]
[null,"00002111",{"$f":"VLOOKUP('BD Personal'!B19,'BD Personal'!B19:L418,1,FALSE)","v":"Jara Romero, Luis Marcelo"},{"$f":"VLOOKUP('BD Personal'!B19,'BD Personal'!$B$2:$L$401,2,FALSE)","v":"Técnico"},{"$f":"VLOOKUP('BD Personal'!B19,'BD Personal'!$B$2:$L$401,4,FALSE)","v":34713},{"$f":"VLOOKUP('BD Personal'!$B19,'BD Personal'!$B$2:$L$401,6,FALSE)","v":"1972-10-08"},{"$f":"VLOOKUP('BD Personal'!$B19,'BD Personal'!$B$2:$L$401,7,FALSE)","v":"M"},{"$f":"VLOOKUP('BD Personal'!$B19,'BD Personal'!$B$2:$L$401,8,FALSE)","v":"Local 2"},{"$f":"VLOOKUP('BD Personal'!$B19,'BD Personal'!$B$2:$L$401,9,FALSE)","v":"Gerencia 5"},{"$f":"IFERROR(E15>=35000,\" \")","v":false}]
[null,"00002423",{"$f":"VLOOKUP('BD Personal'!B22,'BD Personal'!B22:L421,1,FALSE)","v":"Juárez Herrera, José Felipe"},{"$f":"VLOOKUP('BD Personal'!B22,'BD Personal'!$B$2:$L$401,2,FALSE)","v":"Técnico"},{"$f":"VLOOKUP('BD Personal'!B22,'BD Personal'!$B$2:$L$401,4,FALSE)","v":34996},{"$f":"VLOOKUP('BD Personal'!$B22,'BD Personal'!$B$2:$L$401,6,FALSE)","v":"1971-02-24"},{"$f":"VLOOKUP('BD Personal'!$B22,'BD Personal'!$B$2:$L$401,7,FALSE)","v":"M"},{"$f":"VLOOKUP('BD Personal'!$B22,'BD Personal'!$B$2:$L$401,8,FALSE)","v":"Local 3"},{"$f":"VLOOKUP('BD Personal'!$B22,'BD Personal'!$B$2:$L$401,9,FALSE)","v":"Gerencia 5"},{"$f":"IFERROR(E16>=35000,\" \")","v":false}]
[null,"00001504",{"$f":"VLOOKUP('BD Personal'!B8,'BD Personal'!B8:L407,1,FALSE)","v":"Mendoza Silva, Benjamín Fabián"},{"$f":"VLOOKUP('BD Personal'!B8,'BD Personal'!$B$2:$L$401,2,FALSE)","v":"Técnico"},{"$f":"VLOOKUP('BD Personal'!B8,'BD Personal'!$B$2:$L$401,4,FALSE)","v":33841},{"$f":"VLOOKUP('BD Personal'!$B8,'BD Personal'!$B$2:$L$401,6,FALSE)","v":"1963-04-17"},{"$f":"VLOOKUP('BD Personal'!$B8,'BD Personal'!$B$2:$L$401,7,FALSE)","v":"M"},{"$f":"VLOOKUP('BD Personal'!$B8,'BD Personal'!$B$2:$L$401,8,FALSE)","v":"Local 3"},{"$f":"VLOOKUP('BD Personal'!$B8,'BD Personal'!$B$2:$L$401,9,FALSE)","v":"Gerencia 5"},{"$f":"IFERROR(E17>=35000,\" \")","v":false}]
[null,"00001906",{"$f":"VLOOKUP('BD Personal'!B14,'BD Personal'!B14:L413,1,FALSE)","v":"Mendoza Venegas, Salomé Fernanda"},{"$f":"VLOOKUP('BD Personal'!B14,'BD Personal'!$B$2:$L$401,2,FALSE)","v":"Técnico"},{"$f":"VLOOKUP('BD Personal'!B14,'BD Personal'!$B$2:$L$401,4,FALSE)","v":34359},{"$f":"VLOOKUP('BD Personal'!$B14,'BD Personal'!$B$2:$L$401,6,FALSE)","v":"1969-08-01"},{"$f":"VLOOKUP('BD Personal'!$B14,'BD Personal'!$B$2:$L$401,7,FALSE)","v":"F"},{"$f":"VLOOKUP('BD Personal'!$B14,'BD Personal'!$B$2:$L$401,8,FALSE)","v":"Local 3"},{"$f":"VLOOKUP('BD Personal'!$B14,'BD Personal'!$B$2:$L$401,9,FALSE)","v":"Gerencia 4"},{"$f":"IFERROR(E18>=35000,\" \")","v":false}]
[null,"00001827",{"$f":"VLOOKUP('BD Personal'!B12,'BD Personal'!B12:L411,1,FALSE)","v":"Morales Riquelme, Sofía Milagros"},{"$f":"VLOOKUP('BD Personal'!B12,'BD Personal'!$B$2:$L$401,2,FALSE)","v":"Profesional"},{"$f":"VLOOKUP('BD Personal'!B12,'BD Personal'!$B$2:$L$401,4,FALSE)","v":34202},{"$f":"VLOOKUP('BD Personal'!$B12,'BD Personal'!$B$2:$L$401,6,FALSE)","v":"1966-08-23"},{"$f":"VLOOKUP('BD Personal'!$B12,'BD Personal'!$B$2:$L$401,7,FALSE)","v":"F"},{"$f":"VLOOKUP('BD Personal'!$B12,'BD Personal'!$B$2:$L$401,8,FALSE)","v":"Local 1"},{"$f":"VLOOKUP('BD Personal'!$B12,'BD Personal'!$B$2:$L$401,9,FALSE)","v":"Gerencia 5"},{"$f":"IFERROR(E19>=35000,\" \")","v":false}]
[null,"00002780",{"$f":"VLOOKUP('BD Personal'!B27,'BD Personal'!B27:L426,1,FALSE)","v":"Ortiz Gómez, Lucas Fabio"},{"$f":"VLOOKUP('BD Personal'!B27,'BD Personal'!$B$2:$L$401,2,FALSE)","v":"Profesional"},{"$f":"VLOOKUP('BD Personal'!B27,'BD Personal'!$B$2:$L$401,4,FALSE)","v":35382},{"$f":"VLOOKUP('BD Personal'!$B27,'BD Personal'!$B$2:$L$401,6,FALSE)","v":"1970-03-13"},{"$f":"VLOOKUP('BD Personal'!$B27,'BD Personal'!$B$2:$L$401,7,FALSE)","v":"M"},{"$f":"VLOOKUP('BD Personal'!$B27,'BD Personal'!$B$2:$L$401,8,FALSE)","v":"Local 2"},{"$f":"VLOOKUP('BD Personal'!$B27,'BD Personal'!$B$2:$L$401,9,FALSE)","v":"Gerencia 4"},{"$f":"IFERROR(E20>=35000,\" \")","v":true}]
[null,"00000451",{"$f":"VLOOKUP('BD Personal'!$B$2,'BD Personal'!$B$2:$L$401,1,FALSE)","v":"Parra García, Jerónimo Santiago"},{"$f":"VLOOKUP('BD Personal'!B2,'BD Personal'!$B$2:$L$401,2,FALSE)","v":"Técnico"},{"$f":"VLOOKUP('BD Personal'!B2,'BD Personal'!$B$2:$L$401,4,FALSE)","v":31053},{"$f":"VLOOKUP('BD Personal'!$B2,'BD Personal'!$B$2:$L$401,6,FALSE)","v":"1956-09-08"},{"$f":"VLOOKUP('BD Personal'!$B2,'BD Personal'!$B$2:$L$401,7,FALSE)","v":"M"},{"$f":"VLOOKUP('BD Personal'!$B2,'BD Personal'!$B$2:$L$401,8,FALSE)","v":"Local 1"},{"$f":"IFERROR(VLOOKUP('BD Personal'!$B2,'BD Personal'!$B$2:$L$401,111,FALSE),\"Falso\")","v":"Falso"},{"$f":"IFERROR(E21>=35000,\" \")","v":false}]
[null,"00002639",{"$f":"VLOOKUP('BD Personal'!B26,'BD Personal'!B26:L425,1,FALSE)","v":"Pereyra Torres, Jesús Luis"},{"$f":"VLOOKUP('BD Personal'!B26,'BD Personal'!$B$2:$L$401,2,FALSE)","v":"Técnico"},{"$f":"VLOOKUP('BD Personal'!B26,'BD Personal'!$B$2:$L$401,4,FALSE)","v":35245},{"$f":"VLOOKUP('BD Personal'!$B26,'BD Personal'!$B$2:$L$401,6,FALSE)","v":"1972-07-15"},{"$f":"VLOOKUP('BD Personal'!$B26,'BD Personal'!$B$2:$L$401,7,FALSE)","v":"M"},{"$f":"VLOOKUP('BD Personal'!$B26,'BD Personal'!$B$2:$L$401,8,FALSE)","v":"Local 1"},{"$f":"VLOOKUP('BD Personal'!$B26,'BD Personal'!$B$2:$L$401,9,FALSE)","v":"Gerencia 3"},{"$f":"IFERROR(E22>=35000,\" \")","v":true}]
[null,"00001975",{"$f":"VLOOKUP('BD Personal'!B15,'BD Personal'!B15:L414,1,FALSE)","v":"Quiroga Bermúdez, Agustina Liz"},{"$f":"VLOOKUP('BD Personal'!B15,'BD Personal'!$B$2:$L$401,2,FALSE)","v":"Técnico"},{"$f":"VLOOKUP('BD Personal'!B15,'BD Personal'!$B$2:$L$401,4,FALSE)","v":34413},{"$f":"VLOOKUP('BD Personal'!$B15,'BD Personal'!$B$2:$L$401,6,FALSE)","v":"1968-05-26"},{"$f":"VLOOKUP('BD Personal'!$B15,'BD Personal'!$B$2:$L$401,7,FALSE)","v":"F"},{"$f":"VLOOKUP('BD Personal'!$B15,'BD Personal'!$B$2:$L$401,8,FALSE)","v":"Local 3"},{"$f":"VLOOKUP('BD Personal'!$B15,'BD Personal'!$B$2:$L$401,9,FALSE)","v":"Gerencia 5"},{"$f":"IFERROR(E23>=35000,\" \")","v":false}]
[null,"00002100",{"$f":"VLOOKUP('BD Personal'!B18,'BD Personal'!B18:L417,1,FALSE)","v":"Quispe Figueroa, Ian Paolo"},{"$f":"VLOOKUP('BD Personal'!B18,'BD Personal'!$B$2:$L$401,2,FALSE)","v":"Profesional"},{"$f":"VLOOKUP('BD Personal'!B18,'BD Personal'!$B$2:$L$401,4,FALSE)","v":34613},{"$f":"VLOOKUP('BD Personal'!$B18,'BD Personal'!$B$2:$L$401,6,FALSE)","v":"1970-01-16"},{"$f":"VLOOKUP('BD Personal'!$B18,'BD Personal'!$B$2:$L$401,7,FALSE)","v":"M"},{"$f":"VLOOKUP('BD Personal'!$B18,'BD Personal'!$B$2:$L$401,8,FALSE)","v":"Local 3"},{"$f":"VLOOKUP('BD Personal'!$B18,'BD Personal'!$B$2:$L$401,9,FALSE)","v":"Gerencia 2"},{"$f":"IFERROR(E24>=35000,\" \")","v":false}]
[null,"00002839",{"$f":"VLOOKUP('BD Personal'!B28,'BD Personal'!B28:L427,1,FALSE)","v":"Ramos Tapia, Felipe Iker"},{"$f":"VLOOKUP('BD Personal'!B28,'BD Personal'!$B$2:$L$401,2,FALSE)","v":"Técnico"},{"$f":"VLOOKUP('BD Personal'!B28,'BD Personal'!$B$2:$L$401,4,FALSE)","v":35500},{"$f":"VLOOKUP('BD Personal'!$B28,'BD Personal'!$B$2:$L$401,6,FALSE)","v":"1971-08-30"},{"$f":"VLOOKUP('BD Personal'!$B28,'BD Personal'!$B$2:$L$401,7,FALSE)","v":"M"},{"$f":"VLOOKUP('BD Personal'!$B28,'BD Personal'!$B$2:$L$401,8,FALSE)","v":"Local 3"},{"$f":"VLOOKUP('BD Personal'!$B28,'BD Personal'!$B$2:$L$401,9,FALSE)","v":"Gerencia 5"},{"$f":"IFERROR(E25>=35000,\" \")","v":true}]
[null,"00001646",{"$f":"VLOOKUP('BD Personal'!B9,'BD Personal'!B9:L408,1,FALSE)","v":"Rodríguez Flores, Iker Tomás"},{"$f":"VLOOKUP('BD Personal'!B9,'BD Personal'!$B$2:$L$401,2,FALSE)","v":"Técnico"},{"$f":"VLOOKUP('BD Personal'!B9,'BD Personal'!$B$2:$L$401,4,FALSE)","v":33855},{"$f":"VLOOKUP('BD Personal'!$B9,'BD Personal'!$B$2:$L$401,6,FALSE)","v":"1966-07-09"},{"$f":"VLOOKUP('BD Personal'!$B9,'BD Personal'!$B$2:$L$401,7,FALSE)","v":"M"},{"$f":"VLOOKUP('BD Personal'!$B9,'BD Personal'!$B$2:$L$401,8,FALSE)","v":"Local 3"},{"$f":"VLOOKUP('BD Personal'!$B9,'BD Personal'!$B$2:$L$401,9,FALSE)","v":"Gerencia 2"},{"$f":"IFERROR(E26>=35000,\" \")","v":false}]
[null,"00001230",{"$f":"VLOOKUP('BD Personal'!B5,'BD Personal'!B5:L404,1,FALSE)","v":"Rodríguez García, Santiago Rafael"},{"$f":"VLOOKUP('BD Personal'!B5,'BD Personal'!$B$2:$L$401,2,FALSE)","v":"Profesional"},{"$f":"VLOOKUP('BD Personal'!B5,'BD Personal'!$B$2:$L$401,4,FALSE)","v":32693},{"$f":"VLOOKUP('BD Personal'!$B5,'BD Personal'!$B$2:$L$401,6,FALSE)","v":"1961-10-31"},{"$f":"VLOOKUP('BD Personal'!$B5,'BD Personal'!$B$2:$L$401,7,FALSE)","v":"M"},{"$f":"VLOOKUP('BD Personal'!$B5,'BD Personal'!$B$2:$L$401,8,FALSE)","v":"Local 2"},{"$f":"VLOOKUP('BD Personal'!$B5,'BD Personal'!$B$2:$L$401,9,FALSE)","v":"Gerencia 1"},{"$f":"IFERROR(E27>=35000,\" \")","v":false}]
[null,"00002013",{"$f":"VLOOKUP('BD Personal'!B16,'BD Personal'!B16:L415,1,FALSE)","v":"Romero Romero, Alexander Marco"},{"$f":"VLOOKUP('BD Personal'!B16,'BD Personal'!$B$2:$L$401,2,FALSE)","v":"Técnico"},{"$f":"VLOOKUP('BD Personal'!B16,'BD Personal'!$B$2:$L$401,4,FALSE)","v":34536},{"$f":"VLOOKUP('BD Personal'!$B16,'BD Personal'!$B$2:$L$401,6,FALSE)","v":"1971-04-04"},{"$f":"VLOOKUP('BD Personal'!$B16,'BD Personal'!$B$2:$L$401,7,FALSE)","v":"M"},{"$f":"VLOOKUP('BD Personal'!$B16,'BD Personal'!$B$2:$L$401,8,FALSE)","v":"Local 3"},{"$f":"VLOOKUP('BD Personal'!$B16,'BD Personal'!$B$2:$L$401,9,FALSE)","v":"Gerencia 2"},{"$f":"IFERROR(E28>=35000,\" \")","v":false}]
[null,"00002533",{"$f":"VLOOKUP('BD Personal'!B24,'BD Personal'!B24:L423,1,FALSE)","v":"Romero Soto, Bruno Marco"},{"$f":"VLOOKUP('BD Personal'!B24,'BD Personal'!$B$2:$L$401,2,FALSE)","v":"Profesional"},{"$f":"VLOOKUP('BD Personal'!B24,'BD Personal'!$B$2:$L$401,4,FALSE)","v":35150},{"$f":"VLOOKUP('BD Personal'!$B24,'BD Personal'!$B$2:$L$401,6,FALSE)","v":"1966-05-09"},{"$f":"VLOOKUP('BD Personal'!$B24,'BD Personal'!$B$2:$L$401,7,FALSE)","v":"M"},{"$f":"VLOOKUP('BD Personal'!$B24,'BD Personal'!$B$2:$L$401,8,FALSE)","v":"Local 3"},{"$f":"VLOOKUP('BD Personal'!$B24,'BD Personal'!$B$2:$L$401,9,FALSE)","v":"Gerencia 3"},{"$f":"IFERROR(E29>=35000,\" \")","v":true}]
[null,"00001303",{"$f":"VLOOKUP('BD Personal'!B6,'BD Personal'!B6:L405,1,FALSE)","v":"Soria Fernández, Ramón Rodrigo"},{"$f":"VLOOKUP('BD Personal'!B6,'BD Personal'!$B$2:$L$401,2,FALSE)","v":"Profesional"},{"$f":"VLOOKUP('BD Personal'!B6,'BD Personal'!$B$2:$L$401,4,FALSE)","v":32752},{"$f":"VLOOKUP('BD Personal'!$B6,'BD Personal'!$B$2:$L$401,6,FALSE)","v":"1959-09-15"},{"$f":"VLOOKUP('BD Personal'!$B6,'BD Personal'!$B$2:$L$401,7,FALSE)","v":"M"},{"$f":"VLOOKUP('BD Personal'!$B6,'BD Personal'!$B$2:$L$401,8,FALSE)","v":"Local 3"},{"$f":"VLOOKUP('BD Personal'!$B6,'BD Personal'!$B$2:$L$401,9,FALSE)","v":"Gerencia 1"},{"$f":"IFERROR(E30>=35000,\" \")","v":false}]
[null,"00001440",{"$f":"VLOOKUP('BD Personal'!B7,'BD Personal'!B7:L406,1,FALSE)","v":"Valenzuela Núñez, Julieta Beatriz"},{"$f":"VLOOKUP('BD Personal'!B7,'BD Personal'!$B$2:$L$401,2,FALSE)","v":"Profesional"},{"$f":"VLOOKUP('BD Personal'!B7,'BD Personal'!$B$2:$L$401,4,FALSE)","v":33611},{"$f":"VLOOKUP('BD Personal'!$B7,'BD Personal'!$B$2:$L$401,6,FALSE)","v":"1966-05-29"},{"$f":"VLOOKUP('BD Personal'!$B7,'BD Personal'!$B$2:$L$401,7,FALSE)","v":"F"},{"$f":"VLOOKUP('BD Personal'!$B7,'BD Personal'!$B$2:$L$401,8,FALSE)","v":"Local 2"},{"$f":"VLOOKUP('BD Personal'!$B7,'BD Personal'!$B$2:$L$401,9,FALSE)","v":"Gerencia 4"},{"$f":"IFERROR(E31>=35000,\" \")","v":false}]
[null,"00002521",{"$f":"VLOOKUP('BD Personal'!B23,'BD Personal'!B23:L422,1,FALSE)","v":"Vega Romero, Sarah Maite"},{"$f":"VLOOKUP('BD Personal'!B23,'BD Personal'!$B$2:$L$401,2,FALSE)","v":"Profesional"},{"$f":"VLOOKUP('BD Personal'!B23,'BD Personal'!$B$2:$L$401,4,FALSE)","v":35137},{"$f":"VLOOKUP('BD Personal'!$B23,'BD Personal'!$B$2:$L$401,6,FALSE)","v":"1970-06-29"},{"$f":"VLOOKUP('BD Personal'!$B23,'BD Personal'!$B$2:$L$401,7,FALSE)","v":"F"},{"$f":"VLOOKUP('BD Personal'!$B23,'BD Personal'!$B$2:$L$401,8,FALSE)","v":"Local 1"},{"$f":"VLOOKUP('BD Personal'!$B23,'BD Personal'!$B$2:$L$401,9,FALSE)","v":"Gerencia 4"},{"$f":"IFERROR(E32>=35000,\" \")","v":true}]

{"sheet":"Ejemplo con macros","index":2,"n_rows":31,"n_cols":13,"rows_kept":31,"cut":false,"hidden":false,"merged":[]}
[]
[]
[null,"Código","Apellidos, Nombres","Cargo","Monto","Fecha Nacimiento","Sexo","Local","Centro de Costo","Condición",null,"Macros","Descripcion"]
[null,"00002019","vasda",{"$f":"VLOOKUP('BD Personal'!B16,'BD Personal'!$B$2:$L$401,2,FALSE)","v":"Técnico"},{"$f":"VLOOKUP('BD Personal'!B16,'BD Personal'!$B$2:$L$401,4,FALSE)","v":34536},{"$f":"VLOOKUP('BD Personal'!$B16,'BD Personal'!$B$2:$L$401,6,FALSE)","v":"1971-04-04"},{"$f":"VLOOKUP('BD Personal'!$B16,'BD Personal'!$B$2:$L$401,7,FALSE)","v":"M"},{"$f":"VLOOKUP('BD Personal'!$B16,'BD Personal'!$B$2:$L$401,8,FALSE)","v":"Local 3"},{"$f":"IFERROR(VLOOKUP('BD Personal'!$B17,'BD Personal'!$B$2:$L$401,9,FALSE), \"Errado\")","v":"Gerencia 1"},{"$f":"IFERROR(E4>=35000,\" \")","v":false},null,"Ctrl + i","Función 1, condicional"]
[null,"00002851",{"$f":"VLOOKUP('BD Personal'!B28,'BD Personal'!B28:L427,1,FALSE)","v":"Ramos Tapia, Felipe Iker"},{"$f":"VLOOKUP('BD Personal'!B17,'BD Personal'!$B$2:$L$401,2,FALSE)","v":"Profesional"},{"$f":"VLOOKUP('BD Personal'!B17,'BD Personal'!$B$2:$L$401,4,FALSE)","v":34588},{"$f":"VLOOKUP('BD Personal'!$B17,'BD Personal'!$B$2:$L$401,6,FALSE)","v":"1970-11-15"},{"$f":"VLOOKUP('BD Personal'!$B17,'BD Personal'!$B$2:$L$401,7,FALSE)","v":"M"},{"$f":"VLOOKUP('BD Personal'!$B17,'BD Personal'!$B$2:$L$401,8,FALSE)","v":"Local 3"},{"$f":"IFERROR(VLOOKUP('BD Personal'!$B18,'BD Personal'!$B$2:$L$401,9,FALSE), \"Errado\")","v":"Gerencia 2"},{"$f":"IFERROR(E5>=35000,\" \")","v":false},null,"Ctrl + o","Funcion 2, veracidad de fórmula"]
[null,"00000536",{"$f":"VLOOKUP('BD Personal'!B2,'BD Personal'!B2:L401,1,FALSE)","v":"Parra García, Jerónimo Santiago"},{"$f":"VLOOKUP('BD Personal'!B18,'BD Personal'!$B$2:$L$401,2,FALSE)","v":"Profesional"},{"$f":"VLOOKUP('BD Personal'!B18,'BD Personal'!$B$2:$L$401,4,FALSE)","v":34613},{"$f":"VLOOKUP('BD Personal'!$B18,'BD Personal'!$B$2:$L$401,6,FALSE)","v":"1970-01-16"},{"$f":"VLOOKUP('BD Personal'!$B18,'BD Personal'!$B$2:$L$401,7,FALSE)","v":"M"},{"$f":"VLOOKUP('BD Personal'!$B18,'BD Personal'!$B$2:$L$401,8,FALSE)","v":"Local 3"},{"$f":"IFERROR(VLOOKUP('BD Personal'!$B19,'BD Personal'!$B$2:$L$401,99,FALSE), \"Errado\")","v":"Errado"},{"$f":"IFERROR(E6>=35000,\" \")","v":false},null,"Ctrl + j","Función 3, veracidad de fórmula, opción erradda"]
[null,"00002311",{"$f":"VLOOKUP('BD Personal'!B19,'BD Personal'!B19:L418,1,FALSE)","v":"Jara Romero, Luis Marcelo"},{"$f":"VLOOKUP('BD Personal'!B19,'BD Personal'!$B$2:$L$401,2,FALSE)","v":"Técnico"},{"$f":"VLOOKUP('BD Personal'!B19,'BD Personal'!$B$2:$L$401,4,FALSE)","v":34713},{"$f":"VLOOKUP('BD Personal'!$B19,'BD Personal'!$B$2:$L$401,6,FALSE)","v":"1972-10-08"},{"$f":"VLOOKUP('BD Personal'!$B19,'BD Personal'!$B$2:$L$401,7,FALSE)","v":"M"},{"$f":"VLOOKUP('BD Personal'!$B19,'BD Personal'!$B$2:$L$401,8,FALSE)","v":"Local 2"},{"$f":"IFERROR(VLOOKUP('BD Personal'!$B20,'BD Personal'!$B$2:$L$401,9,FALSE), \"Errado\")","v":"Gerencia 2"},{"$f":"IFERROR(E7>=35000,\" \")","v":false}]
[null,"00001803",{"$f":"VLOOKUP('BD Personal'!B10,'BD Personal'!B10:L409,1,FALSE)","v":"Espinosa Ferreyra, José Fabricio"},{"$f":"VLOOKUP('BD Personal'!B20,'BD Personal'!$B$2:$L$401,2,FALSE)","v":"Técnico"},{"$f":"VLOOKUP('BD Personal'!B20,'BD Personal'!$B$2:$L$401,4,FALSE)","v":34894},{"$f":"VLOOKUP('BD Personal'!$B20,'BD Personal'!$B$2:$L$401,6,FALSE)","v":"1968-03-20"},{"$f":"VLOOKUP('BD Personal'!$B20,'BD Personal'!$B$2:$L$401,7,FALSE)","v":"F"},{"$f":"VLOOKUP('BD Personal'!$B20,'BD Personal'!$B$2:$L$401,8,FALSE)","v":"Local 3"},{"$f":"IFERROR(VLOOKUP('BD Personal'!$B21,'BD Personal'!$B$2:$L$401,99,FALSE), \"Errado\")","v":"Errado"},{"$f":"IFERROR(E8>=35000,\" \")","v":false}]
[null,"00002367",{"$f":"VLOOKUP('BD Personal'!B20,'BD Personal'!B20:L419,1,FALSE)","v":"Díaz Luna, Abril Maite"},{"$f":"VLOOKUP('BD Personal'!B21,'BD Personal'!$B$2:$L$401,2,FALSE)","v":"Profesional"},{"$f":"VLOOKUP('BD Personal'!B21,'BD Personal'!$B$2:$L$401,4,FALSE)","v":34937},{"$f":"VLOOKUP('BD Personal'!$B21,'BD Personal'!$B$2:$L$401,6,FALSE)","v":"1963-07-25"},{"$f":"VLOOKUP('BD Personal'!$B21,'BD Personal'!$B$2:$L$401,7,FALSE)","v":"M"},{"$f":"VLOOKUP('BD Personal'!$B21,'BD Personal'!$B$2:$L$401,8,FALSE)","v":"Local 3"}]
[null,"00001749",{"$f":"VLOOKUP('BD Personal'!B9,'BD Personal'!B9:L408,1,FALSE)","v":"Rodríguez Flores, Iker Tomás"},{"$f":"VLOOKUP('BD Personal'!B22,'BD Personal'!$B$2:$L$401,2,FALSE)","v":"Técnico"},{"$f":"VLOOKUP('BD Personal'!B22,'BD Personal'!$B$2:$L$401,4,FALSE)","v":34996},{"$f":"VLOOKUP('BD Personal'!$B22,'BD Personal'!$B$2:$L$401,6,FALSE)","v":"1971-02-24"},{"$f":"VLOOKUP('BD Personal'!$B22,'BD Personal'!$B$2:$L$401,7,FALSE)","v":"M"},{"$f":"VLOOKUP('BD Personal'!$B22,'BD Personal'!$B$2:$L$401,8,FALSE)","v":"Local 3"}]
[null,"00000965",{"$f":"VLOOKUP('BD Personal'!B3,'BD Personal'!B3:L402,1,FALSE)","v":"Díaz García, Alexander Pedro"},{"$f":"VLOOKUP('BD Personal'!B23,'BD Personal'!$B$2:$L$401,2,FALSE)","v":"Profesional"},{"$f":"VLOOKUP('BD Personal'!B23,'BD Personal'!$B$2:$L$401,4,FALSE)","v":35137},{"$f":"VLOOKUP('BD Personal'!$B23,'BD Personal'!$B$2:$L$401,6,FALSE)","v":"1970-06-29"},{"$f":"VLOOKUP('BD Personal'!$B23,'BD Personal'!$B$2:$L$401,7,FALSE)","v":"F"},{"$f":"VLOOKUP('BD Personal'!$B23,'BD Personal'!$B$2:$L$401,8,FALSE)","v":"Local 1"}]
[null,"00001872",{"$f":"VLOOKUP('BD Personal'!B12,'BD Personal'!B12:L411,1,FALSE)","v":"Morales Riquelme, Sofía Milagros"},{"$f":"VLOOKUP('BD Personal'!B24,'BD Personal'!$B$2:$L$401,2,FALSE)","v":"Profesional"},{"$f":"VLOOKUP('BD Personal'!B24,'BD Personal'!$B$2:$L$401,4,FALSE)","v":35150},{"$f":"VLOOKUP('BD Personal'!$B24,'BD Personal'!$B$2:$L$401,6,FALSE)","v":"1966-05-09"},{"$f":"VLOOKUP('BD Personal'!$B24,'BD Personal'!$B$2:$L$401,7,FALSE)","v":"M"},{"$f":"VLOOKUP('BD Personal'!$B24,'BD Personal'!$B$2:$L$401,8,FALSE)","v":"Local 3"}]
[null,"00002588",{"$f":"VLOOKUP('BD Personal'!B24,'BD Personal'!B24:L423,1,FALSE)","v":"Romero Soto, Bruno Marco"},{"$f":"VLOOKUP('BD Personal'!B25,'BD Personal'!$B$2:$L$401,2,FALSE)","v":"Profesional"},{"$f":"VLOOKUP('BD Personal'!B25,'BD Personal'!$B$2:$L$401,4,FALSE)","v":35224},{"$f":"VLOOKUP('BD Personal'!$B25,'BD Personal'!$B$2:$L$401,6,FALSE)","v":"1972-03-07"},{"$f":"VLOOKUP('BD Personal'!$B25,'BD Personal'!$B$2:$L$401,7,FALSE)","v":"M"},{"$f":"VLOOKUP('BD Personal'!$B25,'BD Personal'!$B$2:$L$401,8,FALSE)","v":"Local 3"}]
[null,"00002111",{"$f":"VLOOKUP('BD Personal'!B18,'BD Personal'!B18:L417,1,FALSE)","v":"Quispe Figueroa, Ian Paolo"},{"$f":"VLOOKUP('BD Personal'!B26,'BD Personal'!$B$2:$L$401,2,FALSE)","v":"Técnico"},{"$f":"VLOOKUP('BD Personal'!B26,'BD Personal'!$B$2:$L$401,4,FALSE)","v":35245},{"$f":"VLOOKUP('BD Personal'!$B26,'BD Personal'!$B$2:$L$401,6,FALSE)","v":"1972-07-15"},{"$f":"VLOOKUP('BD Personal'!$B26,'BD Personal'!$B$2:$L$401,7,FALSE)","v":"M"},{"$f":"VLOOKUP('BD Personal'!$B26,'BD Personal'!$B$2:$L$401,8,FALSE)","v":"Local 1"}]
[null,"00002423",{"$f":"VLOOKUP('BD Personal'!B21,'BD Personal'!B21:L420,1,FALSE)","v":"Domínguez Castillo, Mario Bautista"},{"$f":"VLOOKUP('BD Personal'!B27,'BD Personal'!$B$2:$L$401,2,FALSE)","v":"Profesional"},{"$f":"VLOOKUP('BD Personal'!B27,'BD Personal'!$B$2:$L$401,4,FALSE)","v":35382},{"$f":"VLOOKUP('BD Personal'!$B27,'BD Personal'!$B$2:$L$401,6,FALSE)","v":"1970-03-13"},{"$f":"VLOOKUP('BD Personal'!$B27,'BD Personal'!$B$2:$L$401,7,FALSE)","v":"M"},{"$f":"VLOOKUP('BD Personal'!$B27,'BD Personal'!$B$2:$L$401,8,FALSE)","v":"Local 2"}]
[null,"00001504",{"$f":"VLOOKUP('BD Personal'!B7,'BD Personal'!B7:L406,1,FALSE)","v":"Valenzuela Núñez, Julieta Beatriz"},{"$f":"VLOOKUP('BD Personal'!B28,'BD Personal'!$B$2:$L$401,2,FALSE)","v":"Técnico"},{"$f":"VLOOKUP('BD Personal'!B28,'BD Personal'!$B$2:$L$401,4,FALSE)","v":35500},{"$f":"VLOOKUP('BD Personal'!$B28,'BD Personal'!$B$2:$L$401,6,FALSE)","v":"1971-08-30"},{"$f":"VLOOKUP('BD Personal'!$B28,'BD Personal'!$B$2:$L$401,7,FALSE)","v":"M"},{"$f":"VLOOKUP('BD Personal'!$B28,'BD Personal'!$B$2:$L$401,8,FALSE)","v":"Local 3"}]
[null,"00001906",{"$f":"VLOOKUP('BD Personal'!B13,'BD Personal'!B13:L412,1,FALSE)","v":"Flores Miranda, Daniela Ramona"},{"$f":"VLOOKUP('BD Personal'!B29,'BD Personal'!$B$2:$L$401,2,FALSE)","v":"Profesional"},{"$f":"VLOOKUP('BD Personal'!B29,'BD Personal'!$B$2:$L$401,4,FALSE)","v":35506},{"$f":"VLOOKUP('BD Personal'!$B29,'BD Personal'!$B$2:$L$401,6,FALSE)","v":"1973-09-16"},{"$f":"VLOOKUP('BD Personal'!$B29,'BD Personal'!$B$2:$L$401,7,FALSE)","v":"M"},{"$f":"VLOOKUP('BD Personal'!$B29,'BD Personal'!$B$2:$L$401,8,FALSE)","v":"Local 3"}]
[null,"00001827",{"$f":"VLOOKUP('BD Personal'!B11,'BD Personal'!B11:L410,1,FALSE)","v":"Díaz Saavedra, Álvaro Marcelo"},{"$f":"VLOOKUP('BD Personal'!B30,'BD Personal'!$B$2:$L$401,2,FALSE)","v":"Profesional"},{"$f":"VLOOKUP('BD Personal'!B30,'BD Personal'!$B$2:$L$401,4,FALSE)","v":35514},{"$f":"VLOOKUP('BD Personal'!$B30,'BD Personal'!$B$2:$L$401,6,FALSE)","v":"1973-04-22"},{"$f":"VLOOKUP('BD Personal'!$B30,'BD Personal'!$B$2:$L$401,7,FALSE)","v":"M"},{"$f":"VLOOKUP('BD Personal'!$B30,'BD Personal'!$B$2:$L$401,8,FALSE)","v":"Local 3"}]
[null,"00002780",{"$f":"VLOOKUP('BD Personal'!B26,'BD Personal'!B26:L425,1,FALSE)","v":"Pereyra Torres, Jesús Luis"},{"$f":"VLOOKUP('BD Personal'!B31,'BD Personal'!$B$2:$L$401,2,FALSE)","v":"Ejecutivo"},{"$f":"VLOOKUP('BD Personal'!B31,'BD Personal'!$B$2:$L$401,4,FALSE)","v":35558},{"$f":"VLOOKUP('BD Personal'!$B31,'BD Personal'!$B$2:$L$401,6,FALSE)","v":"1971-09-02"},{"$f":"VLOOKUP('BD Personal'!$B31,'BD Personal'!$B$2:$L$401,7,FALSE)","v":"F"},{"$f":"VLOOKUP('BD Personal'!$B31,'BD Personal'!$B$2:$L$401,8,FALSE)","v":"Local 1"}]
[null,"00000451",{"$f":"VLOOKUP('BD Personal'!$B$2,'BD Personal'!$B$2:$L$401,1,FALSE)","v":"Parra García, Jerónimo Santiago"},{"$f":"VLOOKUP('BD Personal'!B32,'BD Personal'!$B$2:$L$401,2,FALSE)","v":"Profesional"},{"$f":"VLOOKUP('BD Personal'!B32,'BD Personal'!$B$2:$L$401,4,FALSE)","v":35599},{"$f":"VLOOKUP('BD Personal'!$B32,'BD Personal'!$B$2:$L$401,6,FALSE)","v":"1969-04-24"},{"$f":"VLOOKUP('BD Personal'!$B32,'BD Personal'!$B$2:$L$401,7,FALSE)","v":"F"},{"$f":"VLOOKUP('BD Personal'!$B32,'BD Personal'!$B$2:$L$401,8,FALSE)","v":"Local 1"}]
[null,"00002639",{"$f":"VLOOKUP('BD Personal'!B25,'BD Personal'!B25:L424,1,FALSE)","v":"Herrera Guerrero, Alexander Francisco"},{"$f":"VLOOKUP('BD Personal'!B33,'BD Personal'!$B$2:$L$401,2,FALSE)","v":"Profesional"},{"$f":"VLOOKUP('BD Personal'!B33,'BD Personal'!$B$2:$L$401,4,FALSE)","v":35687},{"$f":"VLOOKUP('BD Personal'!$B33,'BD Personal'!$B$2:$L$401,6,FALSE)","v":"1973-03-17"},{"$f":"VLOOKUP('BD Personal'!$B33,'BD Personal'!$B$2:$L$401,7,FALSE)","v":"M"},{"$f":"VLOOKUP('BD Personal'!$B33,'BD Personal'!$B$2:$L$401,8,FALSE)","v":"Local 3"}]
[null,"00001975",{"$f":"VLOOKUP('BD Personal'!B14,'BD Personal'!B14:L413,1,FALSE)","v":"Mendoza Venegas, Salomé Fernanda"},{"$f":"VLOOKUP('BD Personal'!B34,'BD Personal'!$B$2:$L$401,2,FALSE)","v":"Técnico"},{"$f":"VLOOKUP('BD Personal'!B34,'BD Personal'!$B$2:$L$401,4,FALSE)","v":35742},{"$f":"VLOOKUP('BD Personal'!$B34,'BD Personal'!$B$2:$L$401,6,FALSE)","v":"1970-08-26"},{"$f":"VLOOKUP('BD Personal'!$B34,'BD Personal'!$B$2:$L$401,7,FALSE)","v":"M"},{"$f":"VLOOKUP('BD Personal'!$B34,'BD Personal'!$B$2:$L$401,8,FALSE)","v":"Local 2"}]
[null,"00002100",{"$f":"VLOOKUP('BD Personal'!B17,'BD Personal'!B17:L416,1,FALSE)","v":"Castro Quispe, Martín Francisco"},{"$f":"VLOOKUP('BD Personal'!B35,'BD Personal'!$B$2:$L$401,2,FALSE)","v":"Técnico"},{"$f":"VLOOKUP('BD Personal'!B35,'BD Personal'!$B$2:$L$401,4,FALSE)","v":35756},{"$f":"VLOOKUP('BD Personal'!$B35,'BD Personal'!$B$2:$L$401,6,FALSE)","v":"1969-12-10"},{"$f":"VLOOKUP('BD Personal'!$B35,'BD Personal'!$B$2:$L$401,7,FALSE)","v":"F"},{"$f":"VLOOKUP('BD Personal'!$B35,'BD Personal'!$B$2:$L$401,8,FALSE)","v":"Local 1"}]
[null,"00002839",{"$f":"VLOOKUP('BD Personal'!B27,'BD Personal'!B27:L426,1,FALSE)","v":"Ortiz Gómez, Lucas Fabio"},{"$f":"VLOOKUP('BD Personal'!B36,'BD Personal'!$B$2:$L$401,2,FALSE)","v":"Técnico"},{"$f":"VLOOKUP('BD Personal'!B36,'BD Personal'!$B$2:$L$401,4,FALSE)","v":35796},{"$f":"VLOOKUP('BD Personal'!$B36,'BD Personal'!$B$2:$L$401,6,FALSE)","v":"1965-09-19"},{"$f":"VLOOKUP('BD Personal'!$B36,'BD Personal'!$B$2:$L$401,7,FALSE)","v":"M"},{"$f":"VLOOKUP('BD Personal'!$B36,'BD Personal'!$B$2:$L$401,8,FALSE)","v":"Local 3"}]
[null,"00001646",{"$f":"VLOOKUP('BD Personal'!B8,'BD Personal'!B8:L407,1,FALSE)","v":"Mendoza Silva, Benjamín Fabián"},{"$f":"VLOOKUP('BD Personal'!B37,'BD Personal'!$B$2:$L$401,2,FALSE)","v":"Técnico"},{"$f":"VLOOKUP('BD Personal'!B37,'BD Personal'!$B$2:$L$401,4,FALSE)","v":35875},{"$f":"VLOOKUP('BD Personal'!$B37,'BD Personal'!$B$2:$L$401,6,FALSE)","v":"1974-07-17"},{"$f":"VLOOKUP('BD Personal'!$B37,'BD Personal'!$B$2:$L$401,7,FALSE)","v":"M"},{"$f":"VLOOKUP('BD Personal'!$B37,'BD Personal'!$B$2:$L$401,8,FALSE)","v":"Local 2"}]
[null,"00001230",{"$f":"VLOOKUP('BD Personal'!B4,'BD Personal'!B4:L403,1,FALSE)","v":"Farías Rodríguez, Santiago Dylan"},{"$f":"VLOOKUP('BD Personal'!B38,'BD Personal'!$B$2:$L$401,2,FALSE)","v":"Técnico"},{"$f":"VLOOKUP('BD Personal'!B38,'BD Personal'!$B$2:$L$401,4,FALSE)","v":35900},{"$f":"VLOOKUP('BD Personal'!$B38,'BD Personal'!$B$2:$L$401,6,FALSE)","v":"1971-10-07"},{"$f":"VLOOKUP('BD Personal'!$B38,'BD Personal'!$B$2:$L$401,7,FALSE)","v":"M"},{"$f":"VLOOKUP('BD Personal'!$B38,'BD Personal'!$B$2:$L$401,8,FALSE)","v":"Local 2"}]
[null,"00002013",{"$f":"VLOOKUP('BD Personal'!B15,'BD Personal'!B15:L414,1,FALSE)","v":"Quiroga Bermúdez, Agustina Liz"},{"$f":"VLOOKUP('BD Personal'!B39,'BD Personal'!$B$2:$L$401,2,FALSE)","v":"Técnico"},{"$f":"VLOOKUP('BD Personal'!B39,'BD Personal'!$B$2:$L$401,4,FALSE)","v":35971},{"$f":"VLOOKUP('BD Personal'!$B39,'BD Personal'!$B$2:$L$401,6,FALSE)","v":"1967-01-21"},{"$f":"VLOOKUP('BD Personal'!$B39,'BD Personal'!$B$2:$L$401,7,FALSE)","v":"M"},{"$f":"VLOOKUP('BD Personal'!$B39,'BD Personal'!$B$2:$L$401,8,FALSE)","v":"Local 2"}]
[null,"00002533",{"$f":"VLOOKUP('BD Personal'!B23,'BD Personal'!B23:L422,1,FALSE)","v":"Vega Romero, Sarah Maite"},{"$f":"VLOOKUP('BD Personal'!B40,'BD Personal'!$B$2:$L$401,2,FALSE)","v":"Profesional"},{"$f":"VLOOKUP('BD Personal'!B40,'BD Personal'!$B$2:$L$401,4,FALSE)","v":35999},{"$f":"VLOOKUP('BD Personal'!$B40,'BD Personal'!$B$2:$L$401,6,FALSE)","v":"1969-10-25"},{"$f":"VLOOKUP('BD Personal'!$B40,'BD Personal'!$B$2:$L$401,7,FALSE)","v":"M"},{"$f":"VLOOKUP('BD Personal'!$B40,'BD Personal'!$B$2:$L$401,8,FALSE)","v":"Local 1"}]
[null,"00001303",{"$f":"VLOOKUP('BD Personal'!B5,'BD Personal'!B5:L404,1,FALSE)","v":"Rodríguez García, Santiago Rafael"},{"$f":"VLOOKUP('BD Personal'!B41,'BD Personal'!$B$2:$L$401,2,FALSE)","v":"Ejecutivo"},{"$f":"VLOOKUP('BD Personal'!B41,'BD Personal'!$B$2:$L$401,4,FALSE)","v":36009},{"$f":"VLOOKUP('BD Personal'!$B41,'BD Personal'!$B$2:$L$401,6,FALSE)","v":"1968-06-04"},{"$f":"VLOOKUP('BD Personal'!$B41,'BD Personal'!$B$2:$L$401,7,FALSE)","v":"M"},{"$f":"VLOOKUP('BD Personal'!$B41,'BD Personal'!$B$2:$L$401,8,FALSE)","v":"Local 1"}]
[null,"00001440",{"$f":"VLOOKUP('BD Personal'!B6,'BD Personal'!B6:L405,1,FALSE)","v":"Soria Fernández, Ramón Rodrigo"},{"$f":"VLOOKUP('BD Personal'!B42,'BD Personal'!$B$2:$L$401,2,FALSE)","v":"Técnico"},{"$f":"VLOOKUP('BD Personal'!B42,'BD Personal'!$B$2:$L$401,4,FALSE)","v":36174},{"$f":"VLOOKUP('BD Personal'!$B42,'BD Personal'!$B$2:$L$401,6,FALSE)","v":"1965-12-23"},{"$f":"VLOOKUP('BD Personal'!$B42,'BD Personal'!$B$2:$L$401,7,FALSE)","v":"M"},{"$f":"VLOOKUP('BD Personal'!$B42,'BD Personal'!$B$2:$L$401,8,FALSE)","v":"Local 3"}]
[null,"00002521",{"$f":"VLOOKUP('BD Personal'!B22,'BD Personal'!B22:L421,1,FALSE)","v":"Juárez Herrera, José Felipe"},{"$f":"VLOOKUP('BD Personal'!B43,'BD Personal'!$B$2:$L$401,2,FALSE)","v":"Técnico"},{"$f":"VLOOKUP('BD Personal'!B43,'BD Personal'!$B$2:$L$401,4,FALSE)","v":36228},{"$f":"VLOOKUP('BD Personal'!$B43,'BD Personal'!$B$2:$L$401,6,FALSE)","v":"1974-09-14"},{"$f":"VLOOKUP('BD Personal'!$B43,'BD Personal'!$B$2:$L$401,7,FALSE)","v":"F"},{"$f":"VLOOKUP('BD Personal'!$B43,'BD Personal'!$B$2:$L$401,8,FALSE)","v":"Local 2"}]