{"text_format":"1","workbook":"xlsx","n_sheets":3,"sheets":["BD Personal","Ejemplo sin macros","Ejemplo con macros"],"not_rendered":{"charts":0,"images":0,"macros":1,"external_links":0,"defined_names":2,"comments":0,"pivot_tables":0},"unopened":[],"bounds":{"document_bytes":16777216,"sheet_cells":100000,"rows_first":2000,"rows_last":500,"rows_between":2000,"halvings":0,"cell_chars":16384,"cell_head_chars":4096},"cells_cut":0,"cells_raw":0,"read":"whole","date_system":"1900"}

{"sheet":"BD Personal","index":0,"n_rows":401,"n_cols":12,"rows_kept":401,"cut":false,"hidden":false,"merged":[]}
["Código","Apellidos, Nombres","Cargo","Tipo Contrato","Fecha Ingreso","Fecha Fin de Contrato","Fecha Nacimiento","Sexo","Ubicación","Centro de Costo","Sueldo Básico","Bonificaciones"]
["00000451","Parra García, Jerónimo Santiago","Técnico","Plazo indeterminado","1985-01-06",null,"1956-09-08","M","Local 1","Gerencia 4",3313,199]
["00000536","Díaz García, Alexander Pedro","Profesional","Plazo indeterminado","1986-08-06",null,"1962-12-05","M","Local 1","Gerencia General",9376,469]
["00000596","Farías Rodríguez, Santiago Dylan","Técnico","Plazo indeterminado","1988-07-03",null,"1962-09-21","M","Local 2","Gerencia 3",3846,385]
["00000687","Rodríguez García, Santiago Rafael","Profesional","Plazo indeterminado","1989-07-04",null,"1961-10-31","M","Local 2","Gerencia 1",7101,497]
["00000714","Soria Fernández, Ramón Rodrigo","Profesional","Plazo indeterminado","1989-09-01",null,"1959-09-15","M","Local 3","Gerencia 1",5487,329]
["00000797","Valenzuela Núñez, Julieta Beatriz","Profesional","Plazo indeterminado","1992-01-08",null,"1966-05-29","F","Local 2","Gerencia 4",6765,474]
["00000819","Mendoza Silva, Benjamín Fabián","Técnico","Plazo indeterminado","1992-08-25",null,"1963-04-17","M","Local 3","Gerencia 5",4687,422]
["00000849","Rodríguez Flores, Iker Tomás","Técnico","Plazo indeterminado","1992-09-08",null,"1966-07-09","M","Local 3","Gerencia 2",5238,471]
["00000895","Espinosa Ferreyra, José Fabricio","Profesional","Plazo indeterminado","1992-11-04",null,"1967-12-22","M","Local 3","Gerencia 2",5545,499]
["00000933","Díaz Saavedra, Álvaro Marcelo","Técnico","Plazo indeterminado","1993-04-27",null,"1963-12-13","M","Local 2","Gerencia 5",4821,241]
["00000965","Morales Riquelme, Sofía Milagros","Profesional","Plazo indeterminado","1993-08-21",null,"1966-08-23","F","Local 1","Gerencia 5",5480,438]
["00000995","Flores Miranda, Daniela Ramona","Profesional","Plazo indeterminado","1994-01-04",null,"1968-01-03","F","Local 2","Gerencia 2",6058,424]
["00001018","Mendoza Venegas, Salomé Fernanda","Técnico","Plazo indeterminado","1994-01-25",null,"1969-08-01","F","Local 3","Gerencia 4",3412,273]
["00001024","Quiroga Bermúdez, Agustina Liz","Técnico","Plazo indeterminado","1994-03-20",null,"1968-05-26","F","Local 3","Gerencia 5",5944,594]
["00001060","Romero Romero, Alexander Marco","Técnico","Plazo indeterminado","1994-07-21",null,"1971-04-04","M","Local 3","Gerencia 2",5832,583]
["00001090","Castro Quispe, Martín Francisco","Profesional","Plazo indeterminado","1994-09-11",null,"1970-11-15","M","Local 3","Gerencia 1",9920,595]
["00001105","Quispe Figueroa, Ian Paolo","Profesional","Plazo indeterminado","1994-10-06",null,"1970-01-16","M","Local 3","Gerencia 2",7574,379]
["00001147","Jara Romero, Luis Marcelo","Técnico","Plazo indeterminado","1995-01-14",null,"1972-10-08","M","Local 2","Gerencia 5",3970,357]
["00001170","Díaz Luna, Abril Maite","Técnico","Plazo indeterminado","1995-07-14",null,"1968-03-20","F","Local 3","Gerencia 2",4148,207]
{"$rows_left_out":382}
{"sheet":"Ejemplo sin macros","index":1,"n_rows":32,"n_cols":13,"rows_kept":32,"cut":false,"hidden":false,"merged":[]}
[null,"Datos de Trabajadores"]
[]
[]
[null,"Código","Apellidos, Nombres","Cargo","Monto","Fecha Nacimiento","Sexo","Local","Centro de Costo","Condición"]
[null,"00002019","vasda",{"$f":"VLOOKUP('BD Personal'!B17,'BD Personal'!$B$2:$L$401,2,FALSE)","v":"Profesional"},{"$f":"VLOOKUP('BD Personal'!B17,'BD Personal'!$B$2:$L$401,4,FALSE)","v":34588},{"$f":"VLOOKUP('BD Personal'!$B17,'BD Personal'!$B$2:$L$401,6,FALSE)","v":"1970-11-15"},{"$f":"VLOOKUP('BD Personal'!$B17,'BD Personal'!$B$2:$L$401,7,FALSE)","v":"M"},{"$f":"VLOOKUP('BD Personal'!$B17,'BD Personal'!$B$2:$L$401,8,FALSE)","v":"Local 3"},{"$f":"IFERROR(VLOOKUP('BD Personal'!$B17,'BD Personal'!$B$2:$L$401,99,FALSE), \"Errado\")","v":"Errado"},{"$f":"IFERROR(E5>=35000,\" \")","v":false},null,"Función II: Verificar Fórmulas"]
[null,"00002851",{"$f":"VLOOKUP('BD Personal'!B29,'BD Personal'!B29:L428,1,FALSE)","v":"Cortés Quispe, Héctor Samuel"},{"$f":"VLOOKUP('BD Personal'!B29,'BD Personal'!$B$2:$L$401,2,FALSE)","v":"Profesional"},{"$f":"VLOOKUP('BD Personal'!B29,'BD Personal'!$B$2:$L$401,4,FALSE)","v":35506},{"$f":"VLOOKUP('BD Personal'!$B29,'BD Personal'!$B$2:$L$401,6,FALSE)","v":"1973-09-16"},{"$f":"VLOOKUP('BD Personal'!$B29,'BD Personal'!$B$2:$L$401,7,FALSE)","v":"M"},{"$f":"VLOOKUP('BD Personal'!$B29,'BD Personal'!$B$2:$L$401,8,FALSE)","v":"Local 3"},{"$f":"VLOOKUP('BD Personal'!$B29,'BD Personal'!$B$2:$L$401,9,FALSE)","v":"Gerencia 1"},{"$f":"IFERROR(E6>=35000,\" \")","v":true}]
[null,"00000536",{"$f":"VLOOKUP('BD Personal'!B3,'BD Personal'!B3:L402,1,FALSE)","v":"Díaz García, Alexander Pedro"},{"$f":"VLOOKUP('BD Personal'!B3,'BD Personal'!$B$2:$L$401,2,FALSE)","v":"Profesional"},{"$f":"VLOOKUP('BD Personal'!B3,'BD Personal'!$B$2:$L$401,4,FALSE)","v":31630},{"$f":"VLOOKUP('BD Personal'!$B3,'BD Personal'!$B$2:$L$401,6,FALSE)","v":"1962-12-05"},{"$f":"VLOOKUP('BD Personal'!$B3,'BD Personal'!$B$2:$L$401,7,FALSE)","v":"M"},{"$f":"VLOOKUP('BD Personal'!$B3,'BD Personal'!$B$2:$L$401,8,FALSE)","v":"Local 1"},{"$f":"VLOOKUP('BD Personal'!$B3,'BD Personal'!$B$2:$L$401,9,FALSE)","v":"Gerencia General"},{"$f":"IFERROR(E7>=35000,\" \")","v":false}]
[null,"00002311",{"$f":"VLOOKUP('BD Personal'!B20,'BD Personal'!B20:L419,1,FALSE)","v":"Díaz Luna, Abril Maite"},{"$f":"VLOOKUP('BD Personal'!B20,'BD Personal'!$B$2:$L$401,2,FALSE)","v":"Técnico"},{"$f":"VLOOKUP('BD Personal'!B20,'BD Personal'!$B$2:$L$401,4,FALSE)","v":34894},{"$f":"VLOOKUP('BD Personal'!$B20,'BD Personal'!$B$2:$L$401,6,FALSE)","v":"1968-03-20"},{"$f":"VLOOKUP('BD Personal'!$B20,'BD Personal'!$B$2:$L$401,7,FALSE)","v":"F"},{"$f":"VLOOKUP('BD Personal'!$B20,'BD Personal'!$B$2:$L$401,8,FALSE)","v":"Local 3"},{"$f":"VLOOKUP('BD Personal'!$B20,'BD Personal'!$B$2:$L$401,9,FALSE)","v":"Gerencia 2"},{"$f":"IFERROR(E8>=35000,\" \")","v":false}]
[null,"00001803",{"$f":"VLOOKUP('BD Personal'!B11,'BD Personal'!B11:L410,1,FALSE)","v":"Díaz Saavedra, Álvaro Marcelo"},{"$f":"VLOOKUP('BD Personal'!B11,'BD Personal'!$B$2:$L$401,2,FALSE)","v":"Técnico"},{"$f":"VLOOKUP('BD Personal'!B11,'BD Personal'!$B$2:$L$401,4,FALSE)","v":34086},{"$f":"VLOOKUP('BD Personal'!$B11,'BD Personal'!$B$2:$L$401,6,FALSE)","v":"1963-12-13"},{"$f":"VLOOKUP('BD Personal'!$B11,'BD Personal'!$B$2:$L$401,7,FALSE)","v":"M"},{"$f":"VLOOKUP('BD Personal'!$B11,'BD Personal'!$B$2:$L$401,8,FALSE)","v":"Local 2"},{"$f":"VLOOKUP('BD Personal'!$B11,'BD Personal'!$B$2:$L$401,9,FALSE)","v":"Gerencia 5"},{"$f":"IFERROR(E9>=35000,\" \")","v":false}]
[null,"00002367",{"$f":"VLOOKUP('BD Personal'!B21,'BD Personal'!B21:L420,1,FALSE)","v":"Domínguez Castillo, Mario Bautista"},{"$f":"VLOOKUP('BD Personal'!B21,'BD Personal'!$B$2:$L$401,2,FALSE)","v":"Profesional"},{"$f":"VLOOKUP('BD Personal'!B21,'BD Personal'!$B$2:$L$401,4,FALSE)","v":34937},{"$f":"VLOOKUP('BD Personal'!$B21,'BD Personal'!$B$2:$L$401,6,FALSE)","v":"1963-07-25"},{"$f":"VLOOKUP('BD Personal'!$B21,'BD Personal'!$B$2:$L$401,7,FALSE)","v":"M"},{"$f":"VLOOKUP('BD Personal'!$B21,'BD Personal'!$B$2:$L$401,8,FALSE)","v":"Local 3"},{"$f":"VLOOKUP('BD Personal'!$B21,'BD Personal'!$B$2:$L$401,9,FALSE)","v":"Gerencia 2"},{"$f":"IFERROR(E10>=35000,\" \")","v":false}]
[null,"00001749",{"$f":"VLOOKUP('BD Personal'!B10,'BD Personal'!B10:L409,1,FALSE)","v":"Espinosa Ferreyra, José Fabricio"},{"$f":"VLOOKUP('BD Personal'!B10,'BD Personal'!$B$2:$L$401,2,FALSE)","v":"Profesional"},{"$f":"VLOOKUP('BD Personal'!B10,'BD Personal'!$B$2:$L$401,4,FALSE)","v":33912},{"$f":"VLOOKUP('BD Personal'!$B10,'BD Personal'!$B$2:$L$401,6,FALSE)","v":"1967-12-22"},{"$f":"VLOOKUP('BD Personal'!$B10,'BD Personal'!$B$2:$L$401,7,FALSE)","v":"M"},{"$f":"VLOOKUP('BD Personal'!$B10,'BD Personal'!$B$2:$L$401,8,FALSE)","v":"Local 3"},{"$f":"VLOOKUP('BD Personal'!$B10,'BD Personal'!$B$2:$L$401,9,FALSE)","v":"Gerencia 2"},{"$f":"IFERROR(E11>=35000,\" \")","v":false},null,null,"Función I: Condición"]
[null,"00000965",{"$f":"VLOOKUP('BD Personal'!B4,'BD Personal'!B4:L403,1,FALSE)","v":"Farías Rodríguez, Santiago Dylan"},{"$f":"VLOOKUP('BD Personal'!B4,'BD Personal'!$B$2:$L$401,2,FALSE)","v":"Técnico"},{"$f":"VLOOKUP('BD Personal'!B4,'BD Personal'!$B$2:$L$401,4,FALSE)","v":32327},{"$f":"VLOOKUP('BD Personal'!$B4,'BD Personal'!$B$2:$L$401,6,FALSE)","v":"1962-09-21"},{"$f":"VLOOKUP('BD Personal'!$B4,'BD Personal'!$B$2:$L$401,7,FALSE)","v":"M"},{"$f":"VLOOKUP('BD Personal'!$B4,'BD Personal'!$B$2:$L$401,8,FALSE)","v":"Local 2"},{"$f":"VLOOKUP('BD Personal'!$B4,'BD Personal'!$B$2:$L$401,9,FALSE)","v":"Gerencia 3"},{"$f":"IFERROR(E12>=35000,\" \")","v":false}]
[null,"00001872",{"$f":"VLOOKUP('BD Personal'!B13,'BD Personal'!B13:L412,1,FALSE)","v":"Flores Miranda, Daniela Ramona"},{"$f":"VLOOKUP('BD Personal'!B13,'BD Personal'!$B$2:$L$401,2,FALSE)","v":"Profesional"},{"$f":"VLOOKUP('BD Personal'!B13,'BD Personal'!$B$2:$L$401,4,FALSE)","v":34338},{"$f":"VLOOKUP('BD Personal'!$B13,'BD Personal'!$B$2:$L$401,6,FALSE)","v":"1968-01-03"},{"$f":"VLOOKUP('BD Personal'!$B13,'BD Personal'!$B$2:$L$401,7,FALSE)","v":"F"},{"$f":"VLOOKUP('BD Personal'!$B13,'BD Personal'!$B$2:$L$401,8,FALSE)","v":"Local 2"},{"$f":"VLOOKUP('BD Personal'!$B13,'BD Personal'!$B$2:$L$401,9,FALSE)","v":"Gerencia 2"},{"$f":"IFERROR(E13>=35000,\" \")","v":false}]
[null,"00002588",{"$f":"VLOOKUP('BD Personal'!B25,'BD Personal'!B25:L424,1,FALSE)","v":"Herrera Guerrero, Alexander Francisco"},{"$f":"VLOOKUP('BD Personal'!B25,'BD Personal'!$B$2:$L$401,2,FALSE)","v":"Profesional"},{"$f":"VLOOKUP('BD Personal'!B25,'BD Personal'!$B$2:$L$401,4,FALSE)","v":35224},{"$f":"VLOOKUP('BD Personal'!$B25,'BD Personal'!$B$2:$L$401,6,FALSE)","v":"1972-03-07"},{"$f":"VLOOKUP('BD Personal'!$B25,'BD Personal'!$B$2:$L$401,7,FALSE)","v":"M"},{"$f":"VLOOKUP('BD Personal'!$B25,'BD Personal'!$B$2:$L$401,8,FALSE)","v":"Local 3"},{"$f":"VLOOKUP('BD Personal'!$B25,'BD Personal'!$B$2:$L$401,9,FALSE)","v":"Gerencia 5"},{"$f":"IFERROR(E14>=35000,\" \")","v":true}]
[null,"00002111",{"$f":"VLOOKUP('BD Personal'!B19,'BD Personal'!B19:L418,1,FALSE)","v":"Jara Romero, Luis Marcelo"},{"$f":"VLOOKUP('BD Personal'!B19,'BD Personal'!$B$2:$L$401,2,FALSE)","v":"Técnico"},{"$f":"VLOOKUP('BD Personal'!B19,'BD Personal'!$B$2:$L$401,4,FALSE)","v":34713},{"$f":"VLOOKUP('BD Personal'!$B19,'BD Personal'!$B$2:$L$401,6,FALSE)","v":"1972-10-08"},{"$f":"VLOOKUP('BD Personal'!$B19,'BD Personal'!$B$2:$L$401,7,FALSE)","v":"M"},{"$f":"VLOOKUP('BD Personal'!$B19,'BD Personal'!$B$2:$L$401,8,FALSE)","v":"Local 2"},{"$f":"VLOOKUP('BD Personal'!$B19,'BD Personal'!$B$2:$L$401,9,FALSE)","v":"Gerencia 5"},{"$f":"IFERROR(E15>=35000,\" \")","v":false}]
[null,"00002423",{"$f":"VLOOKUP('BD Personal'!B22,'BD Personal'!B22:L421,1,FALSE)","v":"Juárez Herrera, José Felipe"},{"$f":"VLOOKUP('BD Personal'!B22,'BD Personal'!$B$2:$L$401,2,FALSE)","v":"Técnico"},{"$f":"VLOOKUP('BD Personal'!B22,'BD Personal'!$B$2:$L$401,4,FALSE)","v":34996},{"$f":"VLOOKUP('BD Personal'!$B22,'BD Personal'!$B$2:$L$401,6,FALSE)","v":"1971-02-24"},{"$f":"VLOOKUP('BD Personal'!$B22,'BD Personal'!$B$2:$L$401,7,FALSE)","v":"M"},{"$f":"VLOOKUP('BD Personal'!$B22,'BD Personal'!$B$2:$L$401,8,FALSE)","v":"Local 3"},{"$f":"VLOOKUP('BD Personal'!$B22,'BD Personal'!$B$2:$L$401,9,FALSE)","v":"Gerencia 5"},{"$f":"IFERROR(E16>=35000,\" \")","v":false}]
[null,"00001504",{"$f":"VLOOKUP('BD Personal'!B8,'BD Personal'!B8:L407,1,FALSE)","v":"Mendoza Silva, Benjamín Fabián"},{"$f":"VLOOKUP('BD Personal'!B8,'BD Personal'!$B$2:$L$401,2,FALSE)","v":"Técnico"},{"$f":"VLOOKUP('BD Personal'!B8,'BD Personal'!$B$2:$L$401,4,FALSE)","v":33841},{"$f":"VLOOKUP('BD Personal'!$B8,'BD Personal'!$B$2:$L$401,6,FALSE)","v":"1963-04-17"},{"$f":"VLOOKUP('BD Personal'!$B8,'BD Personal'!$B$2:$L$401,7,FALSE)","v":"M"},{"$f":"VLOOKUP('BD Personal'!$B8,'BD Personal'!$B$2:$L$401,8,FALSE)","v":"Local 3"},{"$f":"VLOOKUP('BD Personal'!$B8,'BD Personal'!$B$2:$L$401,9,FALSE)","v":"Gerencia 5"},{"$f":"IFERROR(E17>=35000,\" \")","v":false}]
[null,"00001906",{"$f":"VLOOKUP('BD Personal'!B14,'BD Personal'!B14:L413,1,FALSE)","v":"Mendoza Venegas, Salomé Fernanda"},{"$f":"VLOOKUP('BD Personal'!B14,'BD Personal'!$B$2:$L$401,2,FALSE)","v":"Técnico"},{"$f":"VLOOKUP('BD Personal'!B14,'BD Personal'!$B$2:$L$401,4,FALSE)","v":34359},{"$f":"VLOOKUP('BD Personal'!$B14,'BD Personal'!$B$2:$L$401,6,FALSE)","v":"1969-08-01"},{"$f":"VLOOKUP('BD Personal'!$B14,'BD Personal'!$B$2:$L$401,7,FALSE)","v":"F"},{"$f":"VLOOKUP('BD Personal'!$B14,'BD Personal'!$B$2:$L$401,8,FALSE)","v":"Local 3"},{"$f":"VLOOKUP('BD Personal'!$B14,'BD Personal'!$B$2:$L$401,9,FALSE)","v":"Gerencia 4"},{"$f":"IFERROR(E18>=35000,\" \")","v":false}]
[null,"00001827",{"$f":"VLOOKUP('BD Personal'!B12,'BD Personal'!B12:L411,1,FALSE)","v":"Morales Riquelme, Sofía Milagros"},{"$f":"VLOOKUP('BD Personal'!B12,'BD Personal'!$B$2:$L$401,2,FALSE)","v":"Profesional"},{"$f":"VLOOKUP('BD Personal'!B12,'BD Personal'!$B$2:$L$401,4,FALSE)","v":34202},{"$f":"VLOOKUP('BD Personal'!$B12,'BD Personal'!$B$2:$L$401,6,FALSE)","v":"1966-08-23"},{"$f":"VLOOKUP('BD Personal'!$B12,'BD Personal'!$B$2:$L$401,7,FALSE)","v":"F"},{"$f":"VLOOKUP('BD Personal'!$B12,'BD Personal'!$B$2:$L$401,8,FALSE)","v":"Local 1"},{"$f":"VLOOKUP('BD Personal'!$B12,'BD Personal'!$B$2:$L$401,9,FALSE)","v":"Gerencia 5"},{"$f":"IFERROR(E19>=35000,\" \")","v":false}]
[null,"00002780",{"$f":"VLOOKUP('BD Personal'!B27,'BD Personal'!B27:L426,1,FALSE)","v":"Ortiz Gómez, Lucas Fabio"},{"$f":"VLOOKUP('BD Personal'!B27,'BD Personal'!$B$2:$L$401,2,FALSE)","v":"Profesional"},{"$f":"VLOOKUP('BD Personal'!B27,'BD Personal'!$B$2:$L$401,4,FALSE)","v":35382},{"$f":"VLOOKUP('BD Personal'!$B27,'BD Personal'!$B$2:$L$401,6,FALSE)","v":"1970-03-13"},{"$f":"VLOOKUP('BD Personal'!$B27,'BD Personal'!$B$2:$L$401,7,FALSE)","v":"M"},{"$f":"VLOOKUP('BD Personal'!$B27,'BD Personal'!$B$2:$L$401,8,FALSE)","v":"Local 2"},{"$f":"VLOOKUP('BD Personal'!$B27,'BD Personal'!$B$2:$L$401,9,FALSE)","v":"Gerencia 4"},{"$f":"IFERROR(E20>=35000,\" \")","v":true}]
{"$rows_left_out":13}
{"sheet":"Ejemplo con macros","index":2,"n_rows":31,"n_cols":13,"rows_kept":31,"cut":false,"hidden":false,"merged":[]}
[]
[]
[null,"Código","Apellidos, Nombres","Cargo","Monto","Fecha Nacimiento","Sexo","Local","Centro de Costo","Condición",null,"Macros","Descripcion"]
[null,"00002019","vasda",{"$f":"VLOOKUP('BD Personal'!B16,'BD Personal'!$B$2:$L$401,2,FALSE)","v":"Técnico"},{"$f":"VLOOKUP('BD Personal'!B16,'BD Personal'!$B$2:$L$401,4,FALSE)","v":34536},{"$f":"VLOOKUP('BD Personal'!$B16,'BD Personal'!$B$2:$L$401,6,FALSE)","v":"1971-04-04"},{"$f":"VLOOKUP('BD Personal'!$B16,'BD Personal'!$B$2:$L$401,7,FALSE)","v":"M"},{"$f":"VLOOKUP('BD Personal'!$B16,'BD Personal'!$B$2:$L$401,8,FALSE)","v":"Local 3"},{"$f":"IFERROR(VLOOKUP('BD Personal'!$B17,'BD Personal'!$B$2:$L$401,9,FALSE), \"Errado\")","v":"Gerencia 1"},{"$f":"IFERROR(E4>=35000,\" \")","v":false},null,"Ctrl + i","Función 1, condicional"]
[null,"00002851",{"$f":"VLOOKUP('BD Personal'!B28,'BD Personal'!B28:L427,1,FALSE)","v":"Ramos Tapia, Felipe Iker"},{"$f":"VLOOKUP('BD Personal'!B17,'BD Personal'!$B$2:$L$401,2,FALSE)","v":"Profesional"},{"$f":"VLOOKUP('BD Personal'!B17,'BD Personal'!$B$2:$L$401,4,FALSE)","v":34588},{"$f":"VLOOKUP('BD Personal'!$B17,'BD Personal'!$B$2:$L$401,6,FALSE)","v":"1970-11-15"},{"$f":"VLOOKUP('BD Personal'!$B17,'BD Personal'!$B$2:$L$401,7,FALSE)","v":"M"},{"$f":"VLOOKUP('BD Personal'!$B17,'BD Personal'!$B$2:$L$401,8,FALSE)","v":"Local 3"},{"$f":"IFERROR(VLOOKUP('BD Personal'!$B18,'BD Personal'!$B$2:$L$401,9,FALSE), \"Errado\")","v":"Gerencia 2"},{"$f":"IFERROR(E5>=35000,\" \")","v":false},null,"Ctrl + o","Funcion 2, veracidad de fórmula"]
[null,"00000536",{"$f":"VLOOKUP('BD Personal'!B2,'BD Personal'!B2:L401,1,FALSE)","v":"Parra García, Jerónimo Santiago"},{"$f":"VLOOKUP('BD Personal'!B18,'BD Personal'!$B$2:$L$401,2,FALSE)","v":"Profesional"},{"$f":"VLOOKUP('BD Personal'!B18,'BD Personal'!$B$2:$L$401,4,FALSE)","v":34613},{"$f":"VLOOKUP('BD Personal'!$B18,'BD Personal'!$B$2:$L$401,6,FALSE)","v":"1970-01-16"},{"$f":"VLOOKUP('BD Personal'!$B18,'BD Personal'!$B$2:$L$401,7,FALSE)","v":"M"},{"$f":"VLOOKUP('BD Personal'!$B18,'BD Personal'!$B$2:$L$401,8,FALSE)","v":"Local 3"},{"$f":"IFERROR(VLOOKUP('BD Personal'!$B19,'BD Personal'!$B$2:$L$401,99,FALSE), \"Errado\")","v":"Errado"},{"$f":"IFERROR(E6>=35000,\" \")","v":false},null,"Ctrl + j","Función 3, veracidad de fórmula, opción erradda"]
[null,"00002311",{"$f":"VLOOKUP('BD Personal'!B19,'BD Personal'!B19:L418,1,FALSE)","v":"Jara Romero, Luis Marcelo"},{"$f":"VLOOKUP('BD Personal'!B19,'BD Personal'!$B$2:$L$401,2,FALSE)","v":"Técnico"},{"$f":"VLOOKUP('BD Personal'!B19,'BD Personal'!$B$2:$L$401,4,FALSE)","v":34713},{"$f":"VLOOKUP('BD Personal'!$B19,'BD Personal'!$B$2:$L$401,6,FALSE)","v":"1972-10-08"},{"$f":"VLOOKUP('BD Personal'!$B19,'BD Personal'!$B$2:$L$401,7,FALSE)","v":"M"},{"$f":"VLOOKUP('BD Personal'!$B19,'BD Personal'!$B$2:$L$401,8,FALSE)","v":"Local 2"},{"$f":"IFERROR(VLOOKUP('BD Personal'!$B20,'BD Personal'!$B$2:$L$401,9,FALSE), \"Errado\")","v":"Gerencia 2"},{"$f":"IFERROR(E7>=35000,\" \")","v":false}]
[null,"00001803",{"$f":"VLOOKUP('BD Personal'!B10,'BD Personal'!B10:L409,1,FALSE)","v":"Espinosa Ferreyra, José Fabricio"},{"$f":"VLOOKUP('BD Personal'!B20,'BD Personal'!$B$2:$L$401,2,FALSE)","v":"Técnico"},{"$f":"VLOOKUP('BD Personal'!B20,'BD Personal'!$B$2:$L$401,4,FALSE)","v":34894},{"$f":"VLOOKUP('BD Personal'!$B20,'BD Personal'!$B$2:$L$401,6,FALSE)","v":"1968-03-20"},{"$f":"VLOOKUP('BD Personal'!$B20,'BD Personal'!$B$2:$L$401,7,FALSE)","v":"F"},{"$f":"VLOOKUP('BD Personal'!$B20,'BD Personal'!$B$2:$L$401,8,FALSE)","v":"Local 3"},{"$f":"IFERROR(VLOOKUP('BD Personal'!$B21,'BD Personal'!$B$2:$L$401,99,FALSE), \"Errado\")","v":"Errado"},{"$f":"IFERROR(E8>=35000,\" \")","v":false}]
[null,"00002367",{"$f":"VLOOKUP('BD Personal'!B20,'BD Personal'!B20:L419,1,FALSE)","v":"Díaz Luna, Abril Maite"},{"$f":"VLOOKUP('BD Personal'!B21,'BD Personal'!$B$2:$L$401,2,FALSE)","v":"Profesional"},{"$f":"VLOOKUP('BD Personal'!B21,'BD Personal'!$B$2:$L$401,4,FALSE)","v":34937},{"$f":"VLOOKUP('BD Personal'!$B21,'BD Personal'!$B$2:$L$401,6,FALSE)","v":"1963-07-25"},{"$f":"VLOOKUP('BD Personal'!$B21,'BD Personal'!$B$2:$L$401,7,FALSE)","v":"M"},{"$f":"VLOOKUP('BD Personal'!$B21,'BD Personal'!$B$2:$L$401,8,FALSE)","v":"Local 3"}]
[null,"00001749",{"$f":"VLOOKUP('BD Personal'!B9,'BD Personal'!B9:L408,1,FALSE)","v":"Rodríguez Flores, Iker Tomás"},{"$f":"VLOOKUP('BD Personal'!B22,'BD Personal'!$B$2:$L$401,2,FALSE)","v":"Técnico"},{"$f":"VLOOKUP('BD Personal'!B22,'BD Personal'!$B$2:$L$401,4,FALSE)","v":34996},{"$f":"VLOOKUP('BD Personal'!$B22,'BD Personal'!$B$2:$L$401,6,FALSE)","v":"1971-02-24"},{"$f":"VLOOKUP('BD Personal'!$B22,'BD Personal'!$B$2:$L$401,7,FALSE)","v":"M"},{"$f":"VLOOKUP('BD Personal'!$B22,'BD Personal'!$B$2:$L$401,8,FALSE)","v":"Local 3"}]
[null,"00000965",{"$f":"VLOOKUP('BD Personal'!B3,'BD Personal'!B3:L402,1,FALSE)","v":"Díaz García, Alexander Pedro"},{"$f":"VLOOKUP('BD Personal'!B23,'BD Personal'!$B$2:$L$401,2,FALSE)","v":"Profesional"},{"$f":"VLOOKUP('BD Personal'!B23,'BD Personal'!$B$2:$L$401,4,FALSE)","v":35137},{"$f":"VLOOKUP('BD Personal'!$B23,'BD Personal'!$B$2:$L$401,6,FALSE)","v":"1970-06-29"},{"$f":"VLOOKUP('BD Personal'!$B23,'BD Personal'!$B$2:$L$401,7,FALSE)","v":"F"},{"$f":"VLOOKUP('BD Personal'!$B23,'BD Personal'!$B$2:$L$401,8,FALSE)","v":"Local 1"}]
[null,"00001872",{"$f":"VLOOKUP('BD Personal'!B12,'BD Personal'!B12:L411,1,FALSE)","v":"Morales Riquelme, Sofía Milagros"},{"$f":"VLOOKUP('BD Personal'!B24,'BD Personal'!$B$2:$L$401,2,FALSE)","v":"Profesional"},{"$f":"VLOOKUP('BD Personal'!B24,'BD Personal'!$B$2:$L$401,4,FALSE)","v":35150},{"$f":"VLOOKUP('BD Personal'!$B24,'BD Personal'!$B$2:$L$401,6,FALSE)","v":"1966-05-09"},{"$f":"VLOOKUP('BD Personal'!$B24,'BD Personal'!$B$2:$L$401,7,FALSE)","v":"M"},{"$f":"VLOOKUP('BD Personal'!$B24,'BD Personal'!$B$2:$L$401,8,FALSE)","v":"Local 3"}]
[null,"00002588",{"$f":"VLOOKUP('BD Personal'!B24,'BD Personal'!B24:L423,1,FALSE)","v":"Romero Soto, Bruno Marco"},{"$f":"VLOOKUP('BD Personal'!B25,'BD Personal'!$B$2:$L$401,2,FALSE)","v":"Profesional"},{"$f":"VLOOKUP('BD Personal'!B25,'BD Personal'!$B$2:$L$401,4,FALSE)","v":35224},{"$f":"VLOOKUP('BD Personal'!$B25,'BD Personal'!$B$2:$L$401,6,FALSE)","v":"1972-03-07"},{"$f":"VLOOKUP('BD Personal'!$B25,'BD Personal'!$B$2:$L$401,7,FALSE)","v":"M"},{"$f":"VLOOKUP('BD Personal'!$B25,'BD Personal'!$B$2:$L$401,8,FALSE)","v":"Local 3"}]
[null,"00002111",{"$f":"VLOOKUP('BD Personal'!B18,'BD Personal'!B18:L417,1,FALSE)","v":"Quispe Figueroa, Ian Paolo"},{"$f":"VLOOKUP('BD Personal'!B26,'BD Personal'!$B$2:$L$401,2,FALSE)","v":"Técnico"},{"$f":"VLOOKUP('BD Personal'!B26,'BD Personal'!$B$2:$L$401,4,FALSE)","v":35245},{"$f":"VLOOKUP('BD Personal'!$B26,'BD Personal'!$B$2:$L$401,6,FALSE)","v":"1972-07-15"},{"$f":"VLOOKUP('BD Personal'!$B26,'BD Personal'!$B$2:$L$401,7,FALSE)","v":"M"},{"$f":"VLOOKUP('BD Personal'!$B26,'BD Personal'!$B$2:$L$401,8,FALSE)","v":"Local 1"}]
[null,"00002423",{"$f":"VLOOKUP('BD Personal'!B21,'BD Personal'!B21:L420,1,FALSE)","v":"Domínguez Castillo, Mario Bautista"},{"$f":"VLOOKUP('BD Personal'!B27,'BD Personal'!$B$2:$L$401,2,FALSE)","v":"Profesional"},{"$f":"VLOOKUP('BD Personal'!B27,'BD Personal'!$B$2:$L$401,4,FALSE)","v":35382},{"$f":"VLOOKUP('BD Personal'!$B27,'BD Personal'!$B$2:$L$401,6,FALSE)","v":"1970-03-13"},{"$f":"VLOOKUP('BD Personal'!$B27,'BD Personal'!$B$2:$L$401,7,FALSE)","v":"M"},{"$f":"VLOOKUP('BD Personal'!$B27,'BD Personal'!$B$2:$L$401,8,FALSE)","v":"Local 2"}]
[null,"00001504",{"$f":"VLOOKUP('BD Personal'!B7,'BD Personal'!B7:L406,1,FALSE)","v":"Valenzuela Núñez, Julieta Beatriz"},{"$f":"VLOOKUP('BD Personal'!B28,'BD Personal'!$B$2:$L$401,2,FALSE)","v":"Técnico"},{"$f":"VLOOKUP('BD Personal'!B28,'BD Personal'!$B$2:$L$401,4,FALSE)","v":35500},{"$f":"VLOOKUP('BD Personal'!$B28,'BD Personal'!$B$2:$L$401,6,FALSE)","v":"1971-08-30"},{"$f":"VLOOKUP('BD Personal'!$B28,'BD Personal'!$B$2:$L$401,7,FALSE)","v":"M"},{"$f":"VLOOKUP('BD Personal'!$B28,'BD Personal'!$B$2:$L$401,8,FALSE)","v":"Local 3"}]
[null,"00001906",{"$f":"VLOOKUP('BD Personal'!B13,'BD Personal'!B13:L412,1,FALSE)","v":"Flores Miranda, Daniela Ramona"},{"$f":"VLOOKUP('BD Personal'!B29,'BD Personal'!$B$2:$L$401,2,FALSE)","v":"Profesional"},{"$f":"VLOOKUP('BD Personal'!B29,'BD Personal'!$B$2:$L$401,4,FALSE)","v":35506},{"$f":"VLOOKUP('BD Personal'!$B29,'BD Personal'!$B$2:$L$401,6,FALSE)","v":"1973-09-16"},{"$f":"VLOOKUP('BD Personal'!$B29,'BD Personal'!$B$2:$L$401,7,FALSE)","v":"M"},{"$f":"VLOOKUP('BD Personal'!$B29,'BD Personal'!$B$2:$L$401,8,FALSE)","v":"Local 3"}]
[null,"00001827",{"$f":"VLOOKUP('BD Personal'!B11,'BD Personal'!B11:L410,1,FALSE)","v":"Díaz Saavedra, Álvaro Marcelo"},{"$f":"VLOOKUP('BD Personal'!B30,'BD Personal'!$B$2:$L$401,2,FALSE)","v":"Profesional"},{"$f":"VLOOKUP('BD Personal'!B30,'BD Personal'!$B$2:$L$401,4,FALSE)","v":35514},{"$f":"VLOOKUP('BD Personal'!$B30,'BD Personal'!$B$2:$L$401,6,FALSE)","v":"1973-04-22"},{"$f":"VLOOKUP('BD Personal'!$B30,'BD Personal'!$B$2:$L$401,7,FALSE)","v":"M"},{"$f":"VLOOKUP('BD Personal'!$B30,'BD Personal'!$B$2:$L$401,8,FALSE)","v":"Local 3"}]
[null,"00002780",{"$f":"VLOOKUP('BD Personal'!B26,'BD Personal'!B26:L425,1,FALSE)","v":"Pereyra Torres, Jesús Luis"},{"$f":"VLOOKUP('BD Personal'!B31,'BD Personal'!$B$2:$L$401,2,FALSE)","v":"Ejecutivo"},{"$f":"VLOOKUP('BD Personal'!B31,'BD Personal'!$B$2:$L$401,4,FALSE)","v":35558},{"$f":"VLOOKUP('BD Personal'!$B31,'BD Personal'!$B$2:$L$401,6,FALSE)","v":"1971-09-02"},{"$f":"VLOOKUP('BD Personal'!$B31,'BD Personal'!$B$2:$L$401,7,FALSE)","v":"F"},{"$f":"VLOOKUP('BD Personal'!$B31,'BD Personal'!$B$2:$L$401,8,FALSE)","v":"Local 1"}]
[null,"00000451",{"$f":"VLOOKUP('BD Personal'!$B$2,'BD Personal'!$B$2:$L$401,1,FALSE)","v":"Parra García, Jerónimo Santiago"},{"$f":"VLOOKUP('BD Personal'!B32,'BD Personal'!$B$2:$L$401,2,FALSE)","v":"Profesional"},{"$f":"VLOOKUP('BD Personal'!B32,'BD Personal'!$B$2:$L$401,4,FALSE)","v":35599},{"$f":"VLOOKUP('BD Personal'!$B32,'BD Personal'!$B$2:$L$401,6,FALSE)","v":"1969-04-24"},{"$f":"VLOOKUP('BD Personal'!$B32,'BD Personal'!$B$2:$L$401,7,FALSE)","v":"F"},{"$f":"VLOOKUP('BD Personal'!$B32,'BD Personal'!$B$2:$L$401,8,FALSE)","v":"Local 1"}]
{"$rows_left_out":11}