{"text_format":"1","workbook":"xlsx","n_sheets":2,"sheets":["Partidos","Tabla"],"not_rendered":{"charts":0,"images":1,"macros":0,"external_links":0,"defined_names":7,"comments":2,"pivot_tables":0},"unopened":[],"bounds":{"document_bytes":16777216,"sheet_cells":100000,"rows_first":2000,"rows_last":500,"rows_between":2000,"halvings":0,"cell_chars":16384,"cell_head_chars":4096},"cells_cut":0,"cells_raw":0,"read":"whole","date_system":"1900"}

{"sheet":"Partidos","index":0,"n_rows":98,"n_cols":42,"rows_kept":98,"cut":false,"hidden":false,"merged":[[7,7,12,7],[7,10,12,10],[13,7,18,7],[13,10,18,10],[19,7,24,7],[19,10,24,10],[31,10,36,10],[37,10,42,10],[96,28,97,28],[37,7,42,7],[96,31,97,31],[57,28,72,28],[57,31,72,31],[91,28,92,28],[91,31,92,31],[75,28,82,28],[75,31,82,31],[85,28,88,28],[85,31,88,31],[60,6,60,11],[0,1,2,5],[4,1,4,2],[3,1,3,5],[99,6,100,11],[6,6,6,11],[91,6,91,11],[96,6,96,11],[25,7,30,7],[25,10,30,10],[43,7,48,7],[76,6,76,11],[43,10,48,10],[49,7,54,7],[49,10,54,10],[85,6,85,11],[31,7,36,7]]}
[null,"COPA MUNDIAL FIFA BRASIL 2014"]
[]
[]
[null,"Añada la diferencia horaria (hh: mm) entre Brasil y su ciudad",null,null,null,null,"Solo debes completar la diferencia horaria (celda C5)  y los goles de los partidos (celdas en rojo)"]
[null,"02:00:00",null,null,null,false]
[]
[null,"Partido","Fecha y Hora Local (Brasil)","FECHA","HORA","Sede","Groupo A"]
[null,1,"2014-06-12T17:00:00",{"$f":"C8+IF(rTimeDifIsItPositive,rTimeDifference,-rTimeDifference)","v":"2014-06-12T15:00:00"},{"$f":"C8+IF(rTimeDifIsItPositive=(1=1),rTimeDifference,-rTimeDifference)","v":41802.625},"Sao Paulo","Brasil",null,3,1,null,"Croacia",null,null,"Pos","EQUIPO","Pts.","PJ","G","E","P","GF","GC","D",null,null,"Pos","EQUIPO","Pts.","PJ","G","E","P","GF","GC","D",null,{"$f":"VLOOKUP(G8,equipo,2,FALSE)","v":{"$error":"#REF!"}},",",{"$f":"VLOOKUP(L8,equipo,2,FALSE)","v":{"$error":"#REF!"}},",",{"$f":"C8-rTimeDifference","v":"2014-06-12T15:00:00"}]
[null,2,"2014-06-13T13:00:00","2014-06-13T11:00:00",{"$f":"C9+IF(rTimeDifIsItPositive,rTimeDifference,-rTimeDifference)","v":41803.458333333328},"Natal","México",null,1,0,null,"Camerún",null,{"$f":"LARGE($Z$9:$Z$12,O9)","v":70507.015275004829},1,{"$f":"VLOOKUP($N9,$Z$9:$AJ$12,3,0)","v":"Brasil"},{"$f":"VLOOKUP($N9,$Z$9:$AJ$12,4,0)","v":7},{"$f":"VLOOKUP($N9,$Z$9:$AJ$12,5,0)","v":3},{"$f":"VLOOKUP($N9,$Z$9:$AJ$12,6,0)","v":2},{"$f":"VLOOKUP($N9,$Z$9:$AJ$12,7,0)","v":1},{"$f":"VLOOKUP($N9,$Z$9:$AJ$12,8,0)","v":0},{"$f":"VLOOKUP($N9,$Z$9:$AJ$12,9,0)","v":7},{"$f":"VLOOKUP($N9,$Z$9:$AJ$12,10,0)","v":2},{"$f":"VLOOKUP($N9,$Z$9:$AJ$12,11,0)","v":5},null,{"$f":"AC9*10000+AJ9*100+AH9+1/(CODE(LEFT(UPPER(AB9),1)))+1/(CODE(MID(UPPER(AB9),2,1))*100)+1/(CODE(MID(UPPER(AB9),3,1))*10000)","v":70507.015275004829},{"$f":"IF(SUM(AD$9:AD$12)<>12,\"\",(SUMPRODUCT(((1000*AC9+10*AJ9+AH9)< (1000*(AC$9:AC$12)+10*(AJ$9:AJ$12)+(AH$9:AH$12)))+0)+1))","v":1},"Brasil",{"$f":"(AE9*3+AF9*1)","v":7},{"$f":"SUM(AE9:AG9)","v":3},{"$f":"SUM((G$8:G$13=AB9)*(I$8:I$13<>\"\")*(J$8:J$13<>\"\")*(I$8:I$13>J$8:J$13),(L$8:L$13=AB9)*(I$8:I$13<>\"\")*(J$8:J$13<>\"\")*(I$8:I$13<J$8:J$13))","v":2},{"$f":"SUM((G$8:G$13=AB9)*(I$8:I$13<>\"\")*(I$8:I$13=J$8:J$13),(L$8:L$13=AB9)*(J$8:J$13<>\"\")*(I$8:I$13=J$8:J$13))","v":1},{"$f":"SUM((G$8:G$13=AB9)*(J$8:J$13<>\"\")*(I$8:I$13<>\"\")*(I$8:I$13<J$8:J$13),(I$8:I$13<>\"\")*(L$8:L$13=AB9)*(J$8:J$13<>\"\")*(I$8:I$13>J$8:J$13))","v":0},{"$f":"SUM((G$8:G$13=AB9)*(I$8:I$13)*(J$8:J$13<>\"\"),(L$8:L$13=AB9)*(J$8:J$13)*(I$8:I$13<>\"\"))","v":7},{"$f":"SUM((G$8:G$13=AB9)*(I$8:I$13<>\"\")*(J$8:J$13),(L$8:L$13=AB9)*(J$8:J$13<>\"\")*(I$8:I$13))","v":2},{"$f":"AH9-AI9","v":5},null,{"$error":"#REF!"},",",{"$error":"#REF!"},",","2014-06-13T11:00:00"]
[null,17,"2014-06-17T16:00:00","2014-06-17T14:00:00",{"$f":"C10+IF(rTimeDifIsItPositive,rTimeDifference,-rTimeDifference)","v":41807.583333333328},"Fortaleza","Brasil",null,0,0,null,"México",null,{"$f":"LARGE($Z$9:$Z$12,O10)","v":70304.013037900586},2,{"$f":"VLOOKUP($N10,$Z$9:$AJ$12,3,0)","v":"México"},{"$f":"VLOOKUP($N10,$Z$9:$AJ$12,4,0)","v":7},{"$f":"VLOOKUP($N10,$Z$9:$AJ$12,5,0)","v":3},{"$f":"VLOOKUP($N10,$Z$9:$AJ$12,6,0)","v":2},{"$f":"VLOOKUP($N10,$Z$9:$AJ$12,7,0)","v":1},{"$f":"VLOOKUP($N10,$Z$9:$AJ$12,8,0)","v":0},{"$f":"VLOOKUP($N10,$Z$9:$AJ$12,9,0)","v":4},{"$f":"VLOOKUP($N10,$Z$9:$AJ$12,10,0)","v":1},{"$f":"VLOOKUP($N10,$Z$9:$AJ$12,11,0)","v":3},null,{"$f":"AC10*10000+AJ10*100+AH10+1/(CODE(LEFT(UPPER(AB10),1)))+1/(CODE(MID(UPPER(AB10),2,1))*100)+1/(CODE(MID(UPPER(AB10),3,1))*10000)","v":30006.01504859018},{"$f":"IF(SUM(AD$9:AD$12)<>12,\"\",(SUMPRODUCT(((1000*AC10+10*AJ10+AH10)< (1000*(AC$9:AC$12)+10*(AJ$9:AJ$12)+(AH$9:AH$12)))+0)+1))","v":3},"Croacia",{"$f":"(AE10*3+AF10*1)","v":3},{"$f":"SUM(AE10:AG10)","v":3},{"$f":"SUM((G$8:G$13=AB10)*(I$8:I$13<>\"\")*(J$8:J$13<>\"\")*(I$8:I$13>J$8:J$13),(L$8:L$13=AB10)*(I$8:I$13<>\"\")*(J$8:J$13<>\"\")*(I$8:I$13<J$8:J$13))","v":1},{"$f":"SUM((G$8:G$13=AB10)*(I$8:I$13<>\"\")*(I$8:I$13=J$8:J$13),(L$8:L$13=AB10)*(J$8:J$13<>\"\")*(I$8:I$13=J$8:J$13))","v":0},{"$f":"SUM((G$8:G$13=AB10)*(J$8:J$13<>\"\")*(I$8:I$13<>\"\")*(I$8:I$13<J$8:J$13),(I$8:I$13<>\"\")*(L$8:L$13=AB10)*(J$8:J$13<>\"\")*(I$8:I$13>J$8:J$13))","v":2},{"$f":"SUM((G$8:G$13=AB10)*(I$8:I$13)*(J$8:J$13<>\"\"),(L$8:L$13=AB10)*(J$8:J$13)*(I$8:I$13<>\"\"))","v":6},{"$f":"SUM((G$8:G$13=AB10)*(I$8:I$13<>\"\")*(J$8:J$13),(L$8:L$13=AB10)*(J$8:J$13<>\"\")*(I$8:I$13))","v":6},{"$f":"AH10-AI10","v":0},null,{"$error":"#REF!"},",",{"$error":"#REF!"},",","2014-06-17T14:00:00"]
{"$rows_left_out":89}
{"sheet":"Tabla","index":1,"n_rows":36,"n_cols":12,"rows_kept":36,"cut":false,"hidden":false,"merged":[]}
[]
[]
[]
["Posición","Equipo","Ronda","PJ","G","E","P","GF","GC","Dif","GF/PJ","GC/PJ"]
[{"$f":"IF($D5=0,\"\",IF(COUNTIF(Partidos!$AB$58:$AB$73,$B5),(INDEX(Partidos!$AA$58:$AA$73,MATCH($B5,Partidos!$AB$58:$AB$73,0))),(IF(C5<>\"Primera Ronda\",\"\",(SUMPRODUCT((((LOOKUP(LEFT(C5,100),{\"Final\",8000;\"Primera Ronda\",100;\"Cuartos de final\",1000;\"Octavos de final\",500;\"Semifinales\",3000}))*10000+100*D5*E5+30*H5-20*I5+J5)<(10000*((LOOKUP(LEFT(C$5:C$36,100),{\"Final\",8000;\"Primera Ronda\",100;\"Cuartos de final\",1000;\"Octavos de final\",500;\"Semifinales\",3000})))+100*(D$5:D$36)*(E$5:E$36)+30*(H$5:H$36)-20*(I$5:I$36)+(J$5:J$36)))+0)+1)))))","v":1},"Alemania",{"$f":"IF(COUNTIF(Partidos!$AB$97:$AB$98,$B5)=1,\"Final\",IF(COUNTIF(Partidos!$AB$86:$AB$89,$B5)=1,\"Semifinales\",IF(COUNTIF(Partidos!$AB$76:$AB$83,$B5)=1,\"Cuartos de final\",IF(COUNTIF(Partidos!$AB$58:$AB$73,$B5)=1,\"Octavos de final\",\"Primera Ronda\"))))","v":"Final"},{"$f":"SUMIF(Partidos!$AB$9:$AB$98,$B5,Partidos!AD$9:AD$98)","v":7},{"$f":"SUMIF(Partidos!$AB$9:$AB$98,$B5,Partidos!AE$9:AE$98)","v":6},{"$f":"SUMIF(Partidos!$AB$9:$AB$98,$B5,Partidos!AF$9:AF$98)","v":1},{"$f":"SUMIF(Partidos!$AB$9:$AB$98,$B5,Partidos!AG$9:AG$98)","v":0},{"$f":"SUMIF(Partidos!$AB$9:$AB$98,$B5,Partidos!AH$9:AH$98)","v":18},{"$f":"SUMIF(Partidos!$AB$9:$AB$98,$B5,Partidos!AI$9:AI$98)","v":4},{"$f":"SUMIF(Partidos!$AB$9:$AB$98,$B5,Partidos!AJ$9:AJ$98)","v":14},{"$f":"IF($D5=0,0,H5/$D5)","v":2.5714285714285716},{"$f":"IF($D5=0,0,I5/$D5)","v":0.5714285714285714}]
[{"$f":"IF($D6=0,\"\",IF(COUNTIF(Partidos!$AB$58:$AB$73,$B6),(INDEX(Partidos!$AA$58:$AA$73,MATCH($B6,Partidos!$AB$58:$AB$73,0))),(IF(C6<>\"Primera Ronda\",\"\",(SUMPRODUCT((((LOOKUP(LEFT(C6,100),{\"Final\",8000;\"Primera Ronda\",100;\"Cuartos de final\",1000;\"Octavos de final\",500;\"Semifinales\",3000}))*10000+100*D6*E6+30*H6-20*I6+J6)<(10000*((LOOKUP(LEFT(C$5:C$36,100),{\"Final\",8000;\"Primera Ronda\",100;\"Cuartos de final\",1000;\"Octavos de final\",500;\"Semifinales\",3000})))+100*(D$5:D$36)*(E$5:E$36)+30*(H$5:H$36)-20*(I$5:I$36)+(J$5:J$36)))+0)+1)))))","v":2},"Argentina",{"$f":"IF(COUNTIF(Partidos!$AB$97:$AB$98,$B6)=1,\"Final\",IF(COUNTIF(Partidos!$AB$86:$AB$89,$B6)=1,\"Semifinales\",IF(COUNTIF(Partidos!$AB$76:$AB$83,$B6)=1,\"Cuartos de final\",IF(COUNTIF(Partidos!$AB$58:$AB$73,$B6)=1,\"Octavos de final\",\"Primera Ronda\"))))","v":"Final"},{"$f":"SUMIF(Partidos!$AB$9:$AB$98,$B6,Partidos!AD$9:AD$98)","v":7},{"$f":"SUMIF(Partidos!$AB$9:$AB$98,$B6,Partidos!AE$9:AE$98)","v":6},{"$f":"SUMIF(Partidos!$AB$9:$AB$98,$B6,Partidos!AF$9:AF$98)","v":0},{"$f":"SUMIF(Partidos!$AB$9:$AB$98,$B6,Partidos!AG$9:AG$98)","v":1},{"$f":"SUMIF(Partidos!$AB$9:$AB$98,$B6,Partidos!AH$9:AH$98)","v":8},{"$f":"SUMIF(Partidos!$AB$9:$AB$98,$B6,Partidos!AI$9:AI$98)","v":4},{"$f":"SUMIF(Partidos!$AB$9:$AB$98,$B6,Partidos!AJ$9:AJ$98)","v":6},{"$f":"IF($D6=0,0,H6/$D6)","v":1.1428571428571428},{"$f":"IF($D6=0,0,I6/$D6)","v":0.5714285714285714}]
[{"$f":"IF($D7=0,\"\",IF(COUNTIF(Partidos!$AB$58:$AB$73,$B7),(INDEX(Partidos!$AA$58:$AA$73,MATCH($B7,Partidos!$AB$58:$AB$73,0))),(IF(C7<>\"Primera Ronda\",\"\",(SUMPRODUCT((((LOOKUP(LEFT(C7,100),{\"Final\",8000;\"Primera Ronda\",100;\"Cuartos de final\",1000;\"Octavos de final\",500;\"Semifinales\",3000}))*10000+100*D7*E7+30*H7-20*I7+J7)<(10000*((LOOKUP(LEFT(C$5:C$36,100),{\"Final\",8000;\"Primera Ronda\",100;\"Cuartos de final\",1000;\"Octavos de final\",500;\"Semifinales\",3000})))+100*(D$5:D$36)*(E$5:E$36)+30*(H$5:H$36)-20*(I$5:I$36)+(J$5:J$36)))+0)+1)))))","v":3},"Holanda",{"$f":"IF(COUNTIF(Partidos!$AB$97:$AB$98,$B7)=1,\"Final\",IF(COUNTIF(Partidos!$AB$86:$AB$89,$B7)=1,\"Semifinales\",IF(COUNTIF(Partidos!$AB$76:$AB$83,$B7)=1,\"Cuartos de final\",IF(COUNTIF(Partidos!$AB$58:$AB$73,$B7)=1,\"Octavos de final\",\"Primera Ronda\"))))","v":"Semifinales"},{"$f":"SUMIF(Partidos!$AB$9:$AB$98,$B7,Partidos!AD$9:AD$98)","v":7},{"$f":"SUMIF(Partidos!$AB$9:$AB$98,$B7,Partidos!AE$9:AE$98)","v":6},{"$f":"SUMIF(Partidos!$AB$9:$AB$98,$B7,Partidos!AF$9:AF$98)","v":0},{"$f":"SUMIF(Partidos!$AB$9:$AB$98,$B7,Partidos!AG$9:AG$98)","v":1},{"$f":"SUMIF(Partidos!$AB$9:$AB$98,$B7,Partidos!AH$9:AH$98)","v":15},{"$f":"SUMIF(Partidos!$AB$9:$AB$98,$B7,Partidos!AI$9:AI$98)","v":4},{"$f":"SUMIF(Partidos!$AB$9:$AB$98,$B7,Partidos!AJ$9:AJ$98)","v":10},{"$f":"IF($D7=0,0,H7/$D7)","v":2.1428571428571428},{"$f":"IF($D7=0,0,I7/$D7)","v":0.5714285714285714}]
[{"$f":"IF($D8=0,\"\",IF(COUNTIF(Partidos!$AB$58:$AB$73,$B8),(INDEX(Partidos!$AA$58:$AA$73,MATCH($B8,Partidos!$AB$58:$AB$73,0))),(IF(C8<>\"Primera Ronda\",\"\",(SUMPRODUCT((((LOOKUP(LEFT(C8,100),{\"Final\",8000;\"Primera Ronda\",100;\"Cuartos de final\",1000;\"Octavos de final\",500;\"Semifinales\",3000}))*10000+100*D8*E8+30*H8-20*I8+J8)<(10000*((LOOKUP(LEFT(C$5:C$36,100),{\"Final\",8000;\"Primera Ronda\",100;\"Cuartos de final\",1000;\"Octavos de final\",500;\"Semifinales\",3000})))+100*(D$5:D$36)*(E$5:E$36)+30*(H$5:H$36)-20*(I$5:I$36)+(J$5:J$36)))+0)+1)))))","v":4},"Brasil",{"$f":"IF(COUNTIF(Partidos!$AB$97:$AB$98,$B8)=1,\"Final\",IF(COUNTIF(Partidos!$AB$86:$AB$89,$B8)=1,\"Semifinales\",IF(COUNTIF(Partidos!$AB$76:$AB$83,$B8)=1,\"Cuartos de final\",IF(COUNTIF(Partidos!$AB$58:$AB$73,$B8)=1,\"Octavos de final\",\"Primera Ronda\"))))","v":"Semifinales"},{"$f":"SUMIF(Partidos!$AB$9:$AB$98,$B8,Partidos!AD$9:AD$98)","v":7},{"$f":"SUMIF(Partidos!$AB$9:$AB$98,$B8,Partidos!AE$9:AE$98)","v":4},{"$f":"SUMIF(Partidos!$AB$9:$AB$98,$B8,Partidos!AF$9:AF$98)","v":1},{"$f":"SUMIF(Partidos!$AB$9:$AB$98,$B8,Partidos!AG$9:AG$98)","v":2},{"$f":"SUMIF(Partidos!$AB$9:$AB$98,$B8,Partidos!AH$9:AH$98)","v":11},{"$f":"SUMIF(Partidos!$AB$9:$AB$98,$B8,Partidos!AI$9:AI$98)","v":14},{"$f":"SUMIF(Partidos!$AB$9:$AB$98,$B8,Partidos!AJ$9:AJ$98)","v":-2},{"$f":"IF($D8=0,0,H8/$D8)","v":1.5714285714285714},{"$f":"IF($D8=0,0,I8/$D8)","v":2}]
[{"$f":"IF($D9=0,\"\",IF(COUNTIF(Partidos!$AB$58:$AB$73,$B9),(INDEX(Partidos!$AA$58:$AA$73,MATCH($B9,Partidos!$AB$58:$AB$73,0))),(IF(C9<>\"Primera Ronda\",\"\",(SUMPRODUCT((((LOOKUP(LEFT(C9,100),{\"Final\",8000;\"Primera Ronda\",100;\"Cuartos de final\",1000;\"Octavos de final\",500;\"Semifinales\",3000}))*10000+100*D9*E9+30*H9-20*I9+J9)<(10000*((LOOKUP(LEFT(C$5:C$36,100),{\"Final\",8000;\"Primera Ronda\",100;\"Cuartos de final\",1000;\"Octavos de final\",500;\"Semifinales\",3000})))+100*(D$5:D$36)*(E$5:E$36)+30*(H$5:H$36)-20*(I$5:I$36)+(J$5:J$36)))+0)+1)))))","v":5},"Costa Rica",{"$f":"IF(COUNTIF(Partidos!$AB$97:$AB$98,$B9)=1,\"Final\",IF(COUNTIF(Partidos!$AB$86:$AB$89,$B9)=1,\"Semifinales\",IF(COUNTIF(Partidos!$AB$76:$AB$83,$B9)=1,\"Cuartos de final\",IF(COUNTIF(Partidos!$AB$58:$AB$73,$B9)=1,\"Octavos de final\",\"Primera Ronda\"))))","v":"Cuartos de final"},{"$f":"SUMIF(Partidos!$AB$9:$AB$98,$B9,Partidos!AD$9:AD$98)","v":5},{"$f":"SUMIF(Partidos!$AB$9:$AB$98,$B9,Partidos!AE$9:AE$98)","v":3},{"$f":"SUMIF(Partidos!$AB$9:$AB$98,$B9,Partidos!AF$9:AF$98)","v":1},{"$f":"SUMIF(Partidos!$AB$9:$AB$98,$B9,Partidos!AG$9:AG$98)","v":1},{"$f":"SUMIF(Partidos!$AB$9:$AB$98,$B9,Partidos!AH$9:AH$98)","v":5},{"$f":"SUMIF(Partidos!$AB$9:$AB$98,$B9,Partidos!AI$9:AI$98)","v":2},{"$f":"SUMIF(Partidos!$AB$9:$AB$98,$B9,Partidos!AJ$9:AJ$98)","v":4},{"$f":"IF($D9=0,0,H9/$D9)","v":1},{"$f":"IF($D9=0,0,I9/$D9)","v":0.4}]
[{"$f":"IF($D10=0,\"\",IF(COUNTIF(Partidos!$AB$58:$AB$73,$B10),(INDEX(Partidos!$AA$58:$AA$73,MATCH($B10,Partidos!$AB$58:$AB$73,0))),(IF(C10<>\"Primera Ronda\",\"\",(SUMPRODUCT((((LOOKUP(LEFT(C10,100),{\"Final\",8000;\"Primera Ronda\",100;\"Cuartos de final\",1000;\"Octavos de final\",500;\"Semifinales\",3000}))*10000+100*D10*E10+30*H10-20*I10+J10)<(10000*((LOOKUP(LEFT(C$5:C$36,100),{\"Final\",8000;\"Primera Ronda\",100;\"Cuartos de final\",1000;\"Octavos de final\",500;\"Semifinales\",3000})))+100*(D$5:D$36)*(E$5:E$36)+30*(H$5:H$36)-20*(I$5:I$36)+(J$5:J$36)))+0)+1)))))","v":6},"Colombia",{"$f":"IF(COUNTIF(Partidos!$AB$97:$AB$98,$B10)=1,\"Final\",IF(COUNTIF(Partidos!$AB$86:$AB$89,$B10)=1,\"Semifinales\",IF(COUNTIF(Partidos!$AB$76:$AB$83,$B10)=1,\"Cuartos de final\",IF(COUNTIF(Partidos!$AB$58:$AB$73,$B10)=1,\"Octavos de final\",\"Primera Ronda\"))))","v":"Cuartos de final"},{"$f":"SUMIF(Partidos!$AB$9:$AB$98,$B10,Partidos!AD$9:AD$98)","v":5},{"$f":"SUMIF(Partidos!$AB$9:$AB$98,$B10,Partidos!AE$9:AE$98)","v":4},{"$f":"SUMIF(Partidos!$AB$9:$AB$98,$B10,Partidos!AF$9:AF$98)","v":0},{"$f":"SUMIF(Partidos!$AB$9:$AB$98,$B10,Partidos!AG$9:AG$98)","v":1},{"$f":"SUMIF(Partidos!$AB$9:$AB$98,$B10,Partidos!AH$9:AH$98)","v":12},{"$f":"SUMIF(Partidos!$AB$9:$AB$98,$B10,Partidos!AI$9:AI$98)","v":4},{"$f":"SUMIF(Partidos!$AB$9:$AB$98,$B10,Partidos!AJ$9:AJ$98)","v":8},{"$f":"IF($D10=0,0,H10/$D10)","v":2.4},{"$f":"IF($D10=0,0,I10/$D10)","v":0.8}]
{"$rows_left_out":26}