{"text_format":"1","workbook":"xlsx","n_sheets":3,"sheets":["DATA","Playa-Zona","Hoja3"],"not_rendered":{"charts":0,"images":0,"macros":1,"external_links":0,"defined_names":0,"comments":0,"pivot_tables":1},"unopened":[],"bounds":{"document_bytes":16777216,"sheet_cells":100000,"rows_first":2000,"rows_last":500,"rows_between":2000,"halvings":0,"cell_chars":16384,"cell_head_chars":4096},"cells_cut":0,"cells_raw":0,"read":"whole","date_system":"1900"}

{"sheet":"DATA","index":0,"n_rows":101,"n_cols":8,"rows_kept":101,"cut":false,"hidden":false,"merged":[]}
["Playa","Persona","Gaseosa","Envase","Cantidad","Gasto","Día ","Zona"]
["Ventanilla","Hombre","CocaCola","Lata",5,11.5,"Sábado",{"$f":"VLOOKUP(A2,'Playa-Zona'!$A$2:$B$8,2,FALSE)","v":"Norte"}]
["Pucusana","Hombre","CocaCola","Lata",5,11.5,"Sábado",{"$f":"VLOOKUP(A3,'Playa-Zona'!$A$2:$B$8,2,FALSE)","v":"Sur"}]
["La Herradura","Hombre","CocaCola","Lata",3,6.8999999999999995,"Sábado",{"$f":"VLOOKUP(A4,'Playa-Zona'!$A$2:$B$8,2,FALSE)","v":"Centro"}]
["Agua Dulce","Mujer","CocaCola","Botella",5,9.5,"Sábado",{"$f":"VLOOKUP(A5,'Playa-Zona'!$A$2:$B$8,2,FALSE)","v":"Centro"}]
["Ventanilla","Hombre","IncaKola","Lata",4,8.4,"Sábado",{"$f":"VLOOKUP(A6,'Playa-Zona'!$A$2:$B$8,2,FALSE)","v":"Norte"}]
["Ancón","Hombre","IncaKola","Lata",3,6.3000000000000007,"Sábado",{"$f":"VLOOKUP(A7,'Playa-Zona'!$A$2:$B$8,2,FALSE)","v":"Norte"}]
["Naplo","Mujer","IncaKola","Botella",2,3.8,"Sábado",{"$f":"VLOOKUP(A8,'Playa-Zona'!$A$2:$B$8,2,FALSE)","v":"Sur"}]
["Pucusana","Mujer","IncaKola","Lata",5,10.5,"Sábado",{"$f":"VLOOKUP(A9,'Playa-Zona'!$A$2:$B$8,2,FALSE)","v":"Sur"}]
["Ventanilla","Hombre","PepsiCola","Botella",1,1.6,"Sábado",{"$f":"VLOOKUP(A10,'Playa-Zona'!$A$2:$B$8,2,FALSE)","v":"Norte"}]
["Agua Dulce","Hombre","PepsiCola","Lata",3,6.6000000000000005,"Sábado",{"$f":"VLOOKUP(A11,'Playa-Zona'!$A$2:$B$8,2,FALSE)","v":"Centro"}]
["Pucusana","Mujer","PepsiCola","Botella",5,8,"Sábado",{"$f":"VLOOKUP(A12,'Playa-Zona'!$A$2:$B$8,2,FALSE)","v":"Sur"}]
["San Bartolo","Hombre","Otras","Botella",2,0,"Sábado",{"$f":"VLOOKUP(A13,'Playa-Zona'!$A$2:$B$8,2,FALSE)","v":"Sur"}]
["Pucusana","Hombre","Otras","Lata",4,0,"Sábado",{"$f":"VLOOKUP(A14,'Playa-Zona'!$A$2:$B$8,2,FALSE)","v":"Sur"}]
["Naplo","Mujer","Otras","Botella",5,0,"Sábado",{"$f":"VLOOKUP(A15,'Playa-Zona'!$A$2:$B$8,2,FALSE)","v":"Sur"}]
["Ancón","Mujer","Otras","Botella",5,0,"Sábado",{"$f":"VLOOKUP(A16,'Playa-Zona'!$A$2:$B$8,2,FALSE)","v":"Norte"}]
["La Herradura","Hombre","CocaCola","Botella",4,7.6,"Domingo",{"$f":"VLOOKUP(A17,'Playa-Zona'!$A$2:$B$8,2,FALSE)","v":"Centro"}]
["San Bartolo","Mujer","CocaCola","Botella",3,5.6999999999999993,"Domingo",{"$f":"VLOOKUP(A18,'Playa-Zona'!$A$2:$B$8,2,FALSE)","v":"Sur"}]
["Ancón","Mujer","CocaCola","Botella",4,7.6,"Domingo",{"$f":"VLOOKUP(A19,'Playa-Zona'!$A$2:$B$8,2,FALSE)","v":"Norte"}]
["Ancón","Hombre","IncaKola","Botella",5,9.5,"Domingo",{"$f":"VLOOKUP(A20,'Playa-Zona'!$A$2:$B$8,2,FALSE)","v":"Norte"}]
["Agua Dulce","Hombre","IncaKola","Botella",5,9.5,"Domingo",{"$f":"VLOOKUP(A21,'Playa-Zona'!$A$2:$B$8,2,FALSE)","v":"Centro"}]
["Pucusana","Hombre","IncaKola","Lata",3,6.3000000000000007,"Domingo",{"$f":"VLOOKUP(A22,'Playa-Zona'!$A$2:$B$8,2,FALSE)","v":"Sur"}]
["Naplo","Mujer","IncaKola","Botella",1,1.9,"Domingo",{"$f":"VLOOKUP(A23,'Playa-Zona'!$A$2:$B$8,2,FALSE)","v":"Sur"}]
["Pucusana","Mujer","PepsiCola","Lata",5,11,"Domingo",{"$f":"VLOOKUP(A24,'Playa-Zona'!$A$2:$B$8,2,FALSE)","v":"Sur"}]
["Ancón","Mujer","PepsiCola","Lata",2,4.4000000000000004,"Domingo",{"$f":"VLOOKUP(A25,'Playa-Zona'!$A$2:$B$8,2,FALSE)","v":"Norte"}]
["Pucusana","Hombre","Otras","Botella",2,0,"Domingo",{"$f":"VLOOKUP(A26,'Playa-Zona'!$A$2:$B$8,2,FALSE)","v":"Sur"}]
["Naplo","Mujer","Otras","Botella",2,0,"Domingo",{"$f":"VLOOKUP(A27,'Playa-Zona'!$A$2:$B$8,2,FALSE)","v":"Sur"}]
["Agua Dulce","Mujer","Otras","Botella",1,0,"Domingo",{"$f":"VLOOKUP(A28,'Playa-Zona'!$A$2:$B$8,2,FALSE)","v":"Centro"}]
["Ventanilla","Mujer","Otras","Lata",5,0,"Domingo",{"$f":"VLOOKUP(A29,'Playa-Zona'!$A$2:$B$8,2,FALSE)","v":"Norte"}]
["Ancón","Mujer","Otras","Lata",2,0,"Domingo",{"$f":"VLOOKUP(A30,'Playa-Zona'!$A$2:$B$8,2,FALSE)","v":"Norte"}]
["La Herradura","Hombre","CocaCola","Botella",1,1.9,"Lunes",{"$f":"VLOOKUP(A31,'Playa-Zona'!$A$2:$B$8,2,FALSE)","v":"Centro"}]
["Ancón","Hombre","CocaCola","Botella",4,7.6,"Lunes",{"$f":"VLOOKUP(A32,'Playa-Zona'!$A$2:$B$8,2,FALSE)","v":"Norte"}]
["San Bartolo","Hombre","CocaCola","Lata",1,2.2999999999999998,"Lunes",{"$f":"VLOOKUP(A33,'Playa-Zona'!$A$2:$B$8,2,FALSE)","v":"Sur"}]
["San Bartolo","Hombre","CocaCola","Botella",1,1.9,"Martes",{"$f":"VLOOKUP(A34,'Playa-Zona'!$A$2:$B$8,2,FALSE)","v":"Sur"}]
["Ancón","Hombre","CocaCola","Botella",2,3.8,"Martes",{"$f":"VLOOKUP(A35,'Playa-Zona'!$A$2:$B$8,2,FALSE)","v":"Norte"}]
["Naplo","Mujer","CocaCola","Botella",5,9.5,"Martes",{"$f":"VLOOKUP(A36,'Playa-Zona'!$A$2:$B$8,2,FALSE)","v":"Sur"}]
["San Bartolo","Hombre","CocaCola","Botella",1,1.9,"Miércoles",{"$f":"VLOOKUP(A37,'Playa-Zona'!$A$2:$B$8,2,FALSE)","v":"Sur"}]
["Naplo","Hombre","CocaCola","Lata",1,2.2999999999999998,"Miércoles",{"$f":"VLOOKUP(A38,'Playa-Zona'!$A$2:$B$8,2,FALSE)","v":"Sur"}]
["La Herradura","Mujer","CocaCola","Botella",3,5.6999999999999993,"Miércoles",{"$f":"VLOOKUP(A39,'Playa-Zona'!$A$2:$B$8,2,FALSE)","v":"Centro"}]
["La Herradura","Hombre","CocaCola","Botella",1,1.9,"Jueves",{"$f":"VLOOKUP(A40,'Playa-Zona'!$A$2:$B$8,2,FALSE)","v":"Centro"}]
["Pucusana","Hombre","CocaCola","Lata",1,2.2999999999999998,"Jueves",{"$f":"VLOOKUP(A41,'Playa-Zona'!$A$2:$B$8,2,FALSE)","v":"Sur"}]
["Ventanilla","Mujer","CocaCola","Botella",4,7.6,"Jueves",{"$f":"VLOOKUP(A42,'Playa-Zona'!$A$2:$B$8,2,FALSE)","v":"Norte"}]
["Pucusana","Hombre","CocaCola","Botella",1,1.9,"Viernes",{"$f":"VLOOKUP(A43,'Playa-Zona'!$A$2:$B$8,2,FALSE)","v":"Sur"}]
["La Herradura","Hombre","CocaCola","Botella",3,5.6999999999999993,"Viernes",{"$f":"VLOOKUP(A44,'Playa-Zona'!$A$2:$B$8,2,FALSE)","v":"Centro"}]
["Ventanilla","Mujer","CocaCola","Botella",3,5.6999999999999993,"Viernes",{"$f":"VLOOKUP(A45,'Playa-Zona'!$A$2:$B$8,2,FALSE)","v":"Norte"}]
["Agua Dulce","Mujer","CocaCola","Lata",4,9.1999999999999993,"Viernes",{"$f":"VLOOKUP(A46,'Playa-Zona'!$A$2:$B$8,2,FALSE)","v":"Centro"}]
["Pucusana","Hombre","IncaKola","Botella",4,7.6,"Lunes",{"$f":"VLOOKUP(A47,'Playa-Zona'!$A$2:$B$8,2,FALSE)","v":"Sur"}]
["Ancón","Hombre","IncaKola","Botella",4,7.6,"Lunes",{"$f":"VLOOKUP(A48,'Playa-Zona'!$A$2:$B$8,2,FALSE)","v":"Norte"}]
["Agua Dulce","Hombre","IncaKola","Botella",4,7.6,"Lunes",{"$f":"VLOOKUP(A49,'Playa-Zona'!$A$2:$B$8,2,FALSE)","v":"Centro"}]
["Naplo","Mujer","IncaKola","Lata",4,8.4,"Lunes",{"$f":"VLOOKUP(A50,'Playa-Zona'!$A$2:$B$8,2,FALSE)","v":"Sur"}]
["Naplo","Hombre","IncaKola","Botella",3,5.6999999999999993,"Martes",{"$f":"VLOOKUP(A51,'Playa-Zona'!$A$2:$B$8,2,FALSE)","v":"Sur"}]
["Agua Dulce","Hombre","IncaKola","Botella",2,3.8,"Martes",{"$f":"VLOOKUP(A52,'Playa-Zona'!$A$2:$B$8,2,FALSE)","v":"Centro"}]
["San Bartolo","Mujer","IncaKola","Botella",5,9.5,"Martes",{"$f":"VLOOKUP(A53,'Playa-Zona'!$A$2:$B$8,2,FALSE)","v":"Sur"}]
["La Herradura","Mujer","IncaKola","Botella",3,5.6999999999999993,"Martes",{"$f":"VLOOKUP(A54,'Playa-Zona'!$A$2:$B$8,2,FALSE)","v":"Centro"}]
["San Bartolo","Hombre","IncaKola","Lata",4,8.4,"Miércoles",{"$f":"VLOOKUP(A55,'Playa-Zona'!$A$2:$B$8,2,FALSE)","v":"Sur"}]
["Naplo","Hombre","IncaKola","Lata",2,4.2,"Miércoles",{"$f":"VLOOKUP(A56,'Playa-Zona'!$A$2:$B$8,2,FALSE)","v":"Sur"}]
["La Herradura","Hombre","IncaKola","Lata",3,6.3000000000000007,"Miércoles",{"$f":"VLOOKUP(A57,'Playa-Zona'!$A$2:$B$8,2,FALSE)","v":"Centro"}]
["Agua Dulce","Hombre","IncaKola","Lata",5,10.5,"Miércoles",{"$f":"VLOOKUP(A58,'Playa-Zona'!$A$2:$B$8,2,FALSE)","v":"Centro"}]
["La Herradura","Hombre","IncaKola","Botella",3,5.6999999999999993,"Jueves",{"$f":"VLOOKUP(A59,'Playa-Zona'!$A$2:$B$8,2,FALSE)","v":"Centro"}]
["San Bartolo","Hombre","IncaKola","Lata",3,6.3000000000000007,"Jueves",{"$f":"VLOOKUP(A60,'Playa-Zona'!$A$2:$B$8,2,FALSE)","v":"Sur"}]
["Naplo","Hombre","IncaKola","Lata",1,2.1,"Jueves",{"$f":"VLOOKUP(A61,'Playa-Zona'!$A$2:$B$8,2,FALSE)","v":"Sur"}]
["Ancón","Mujer","IncaKola","Botella",4,7.6,"Jueves",{"$f":"VLOOKUP(A62,'Playa-Zona'!$A$2:$B$8,2,FALSE)","v":"Norte"}]
["Ventanilla","Hombre","IncaKola","Botella",2,3.8,"Viernes",{"$f":"VLOOKUP(A63,'Playa-Zona'!$A$2:$B$8,2,FALSE)","v":"Norte"}]
["Pucusana","Mujer","IncaKola","Lata",1,2.1,"Viernes",{"$f":"VLOOKUP(A64,'Playa-Zona'!$A$2:$B$8,2,FALSE)","v":"Sur"}]
["Naplo","Mujer","IncaKola","Lata",2,4.2,"Viernes",{"$f":"VLOOKUP(A65,'Playa-Zona'!$A$2:$B$8,2,FALSE)","v":"Sur"}]
["Ancón","Mujer","IncaKola","Lata",3,6.3000000000000007,"Viernes",{"$f":"VLOOKUP(A66,'Playa-Zona'!$A$2:$B$8,2,FALSE)","v":"Norte"}]
["Ancón","Hombre","PepsiCola","Lata",4,8.8000000000000007,"Lunes",{"$f":"VLOOKUP(A67,'Playa-Zona'!$A$2:$B$8,2,FALSE)","v":"Norte"}]
["San Bartolo","Mujer","PepsiCola","Botella",2,3.2,"Lunes",{"$f":"VLOOKUP(A68,'Playa-Zona'!$A$2:$B$8,2,FALSE)","v":"Sur"}]
["Ventanilla","Mujer","PepsiCola","Lata",3,6.6000000000000005,"Martes",{"$f":"VLOOKUP(A69,'Playa-Zona'!$A$2:$B$8,2,FALSE)","v":"Norte"}]
["La Herradura","Mujer","PepsiCola","Lata",4,8.8000000000000007,"Martes",{"$f":"VLOOKUP(A70,'Playa-Zona'!$A$2:$B$8,2,FALSE)","v":"Centro"}]
["Ventanilla","Mujer","PepsiCola","Botella",5,8,"Miércoles",{"$f":"VLOOKUP(A71,'Playa-Zona'!$A$2:$B$8,2,FALSE)","v":"Norte"}]
["La Herradura","Mujer","PepsiCola","Botella",4,6.4,"Miércoles",{"$f":"VLOOKUP(A72,'Playa-Zona'!$A$2:$B$8,2,FALSE)","v":"Centro"}]
["Agua Dulce","Mujer","PepsiCola","Botella",3,4.8000000000000007,"Miércoles",{"$f":"VLOOKUP(A73,'Playa-Zona'!$A$2:$B$8,2,FALSE)","v":"Centro"}]
["Ventanilla","Hombre","PepsiCola","Lata",1,2.2000000000000002,"Jueves",{"$f":"VLOOKUP(A74,'Playa-Zona'!$A$2:$B$8,2,FALSE)","v":"Norte"}]
["Naplo","Mujer","PepsiCola","Botella",3,4.8000000000000007,"Jueves",{"$f":"VLOOKUP(A75,'Playa-Zona'!$A$2:$B$8,2,FALSE)","v":"Sur"}]
["Agua Dulce","Mujer","PepsiCola","Lata",2,4.4000000000000004,"Jueves",{"$f":"VLOOKUP(A76,'Playa-Zona'!$A$2:$B$8,2,FALSE)","v":"Centro"}]
["Agua Dulce","Hombre","PepsiCola","Botella",3,4.8000000000000007,"Viernes",{"$f":"VLOOKUP(A77,'Playa-Zona'!$A$2:$B$8,2,FALSE)","v":"Centro"}]
["Ventanilla","Hombre","PepsiCola","Lata",3,6.6000000000000005,"Viernes",{"$f":"VLOOKUP(A78,'Playa-Zona'!$A$2:$B$8,2,FALSE)","v":"Norte"}]
["Naplo","Hombre","PepsiCola","Lata",4,8.8000000000000007,"Viernes",{"$f":"VLOOKUP(A79,'Playa-Zona'!$A$2:$B$8,2,FALSE)","v":"Sur"}]
["Naplo","Hombre","Otras","Lata",2,0,"Lunes",{"$f":"VLOOKUP(A80,'Playa-Zona'!$A$2:$B$8,2,FALSE)","v":"Sur"}]
["Ancón","Hombre","Otras","Lata",4,0,"Lunes",{"$f":"VLOOKUP(A81,'Playa-Zona'!$A$2:$B$8,2,FALSE)","v":"Norte"}]
["Agua Dulce","Hombre","Otras","Lata",3,0,"Lunes",{"$f":"VLOOKUP(A82,'Playa-Zona'!$A$2:$B$8,2,FALSE)","v":"Centro"}]
["Ventanilla","Mujer","Otras","Botella",4,0,"Lunes",{"$f":"VLOOKUP(A83,'Playa-Zona'!$A$2:$B$8,2,FALSE)","v":"Norte"}]
["San Bartolo","Mujer","Otras","Botella",4,0,"Lunes",{"$f":"VLOOKUP(A84,'Playa-Zona'!$A$2:$B$8,2,FALSE)","v":"Sur"}]
["Ventanilla","Hombre","Otras","Botella",1,0,"Martes",{"$f":"VLOOKUP(A85,'Playa-Zona'!$A$2:$B$8,2,FALSE)","v":"Norte"}]
["Naplo","Hombre","Otras","Lata",3,0,"Martes",{"$f":"VLOOKUP(A86,'Playa-Zona'!$A$2:$B$8,2,FALSE)","v":"Sur"}]
["Agua Dulce","Hombre","Otras","Lata",3,0,"Martes",{"$f":"VLOOKUP(A87,'Playa-Zona'!$A$2:$B$8,2,FALSE)","v":"Centro"}]
["San Bartolo","Mujer","Otras","Botella",5,0,"Martes",{"$f":"VLOOKUP(A88,'Playa-Zona'!$A$2:$B$8,2,FALSE)","v":"Sur"}]
["La Herradura","Mujer","Otras","Botella",5,0,"Martes",{"$f":"VLOOKUP(A89,'Playa-Zona'!$A$2:$B$8,2,FALSE)","v":"Centro"}]
["Agua Dulce","Hombre","Otras","Lata",3,0,"Miércoles",{"$f":"VLOOKUP(A90,'Playa-Zona'!$A$2:$B$8,2,FALSE)","v":"Centro"}]
["Pucusana","Mujer","Otras","Botella",5,0,"Miércoles",{"$f":"VLOOKUP(A91,'Playa-Zona'!$A$2:$B$8,2,FALSE)","v":"Sur"}]
["San Bartolo","Mujer","Otras","Lata",5,0,"Miércoles",{"$f":"VLOOKUP(A92,'Playa-Zona'!$A$2:$B$8,2,FALSE)","v":"Sur"}]
["La Herradura","Mujer","Otras","Lata",4,0,"Miércoles",{"$f":"VLOOKUP(A93,'Playa-Zona'!$A$2:$B$8,2,FALSE)","v":"Centro"}]
["San Bartolo","Hombre","Otras","Lata",4,0,"Jueves",{"$f":"VLOOKUP(A94,'Playa-Zona'!$A$2:$B$8,2,FALSE)","v":"Sur"}]
["La Herradura","Hombre","Otras","Lata",4,0,"Jueves",{"$f":"VLOOKUP(A95,'Playa-Zona'!$A$2:$B$8,2,FALSE)","v":"Centro"}]
["Agua Dulce","Hombre","Otras","Lata",2,0,"Jueves",{"$f":"VLOOKUP(A96,'Playa-Zona'!$A$2:$B$8,2,FALSE)","v":"Centro"}]
["Pucusana","Mujer","Otras","Lata",2,0,"Jueves",{"$f":"VLOOKUP(A97,'Playa-Zona'!$A$2:$B$8,2,FALSE)","v":"Sur"}]
["San Bartolo","Hombre","Otras","Botella",3,0,"Viernes",{"$f":"VLOOKUP(A98,'Playa-Zona'!$A$2:$B$8,2,FALSE)","v":"Sur"}]
["Pucusana","Hombre","Otras","Lata",2,0,"Viernes",{"$f":"VLOOKUP(A99,'Playa-Zona'!$A$2:$B$8,2,FALSE)","v":"Sur"}]
["Naplo","Mujer","Otras","Botella",3,0,"Viernes",{"$f":"VLOOKUP(A100,'Playa-Zona'!$A$2:$B$8,2,FALSE)","v":"Sur"}]
["Ancón","Mujer","Otras","Botella",4,0,"Viernes",{"$f":"VLOOKUP(A101,'Playa-Zona'!$A$2:$B$8,2,FALSE)","v":"Norte"}]

{"sheet":"Playa-Zona","index":1,"n_rows":8,"n_cols":2,"rows_kept":8,"cut":false,"hidden":false,"merged":[]}
["Playa","Zona"]
["Agua Dulce","Centro"]
["Ancón","Norte"]
["La Herradura","Centro"]
["Naplo","Sur"]
["Pucusana","Sur"]
["San Bartolo","Sur"]
["Ventanilla","Norte"]

{"sheet":"Hoja3","index":2,"n_rows":131,"n_cols":10,"rows_kept":131,"cut":false,"hidden":false,"merged":[]}
[]
[null,null,null,null,"Envase","Datos"]
[null,null,null,null,"Botella",null,"Lata",null,"Total Suma de Cantidad","Total Suma de Gasto"]
[null,"Playa","Gaseosa","Persona","Cantidad","Gasto","Cantidad","Gasto"]
[null,"Agua Dulce"]
[null,null,"CocaCola"]
[null,null,null,"Mujer",5,9.5,4,9.1999999999999993,9,18.7]
[null,null,"Total CocaCola",null,5,9.5,4,9.1999999999999993,9,18.7]
[null,null,"IncaKola"]
[null,null,null,"Hombre",11,20.900000000000002,5,10.5,16,31.400000000000002]
[null,null,"Total IncaKola",null,11,20.900000000000002,5,10.5,16,31.400000000000002]
[null,null,"Otras"]
[null,null,null,"Hombre",null,null,11,0,11,0]
[null,null,null,"Mujer",1,0,null,null,1,0]
[null,null,"Total Otras",null,1,0,11,0,12,0]
[null,null,"PepsiCola"]
[null,null,null,"Hombre",3,4.8000000000000007,3,6.6000000000000005,6,11.400000000000002]
[null,null,null,"Mujer",3,4.8000000000000007,2,4.4000000000000004,5,9.2000000000000011]
[null,null,"Total PepsiCola",null,6,9.6000000000000014,5,11,11,20.6]
[null,"Total Agua Dulce",null,null,23,40,25,30.700000000000003,48,70.7]
[]
[null,"Ancón"]
[null,null,"CocaCola"]
[null,null,null,"Hombre",6,11.399999999999999,null,null,6,11.399999999999999]
[null,null,null,"Mujer",4,7.6,null,null,4,7.6]
[null,null,"Total CocaCola",null,10,19,null,null,10,19]
[null,null,"IncaKola"]
[null,null,null,"Hombre",9,17.100000000000001,3,6.3000000000000007,12,23.400000000000002]
[null,null,null,"Mujer",4,7.6,3,6.3000000000000007,7,13.9]
[null,null,"Total IncaKola",null,13,24.700000000000003,6,12.600000000000001,19,37.300000000000004]
[null,null,"Otras"]
[null,null,null,"Hombre",null,null,4,0,4,0]
[null,null,null,"Mujer",9,0,2,0,11,0]
[null,null,"Total Otras",null,9,0,6,0,15,0]
[null,null,"PepsiCola"]
[null,null,null,"Hombre",null,null,4,8.8000000000000007,4,8.8000000000000007]
[null,null,null,"Mujer",null,null,2,4.4000000000000004,2,4.4000000000000004]
[null,null,"Total PepsiCola",null,null,null,6,13.200000000000001,6,13.200000000000001]
[null,"Total Ancón",null,null,32,43.7,18,25.800000000000004,50,69.500000000000014]
[]
[null,"La Herradura"]
[null,null,"CocaCola"]
[null,null,null,"Hombre",9,17.100000000000001,3,6.8999999999999995,12,24]
[null,null,null,"Mujer",3,5.6999999999999993,null,null,3,5.6999999999999993]
[null,null,"Total CocaCola",null,12,22.8,3,6.8999999999999995,15,29.7]
[null,null,"IncaKola"]
[null,null,null,"Hombre",3,5.6999999999999993,3,6.3000000000000007,6,12]
[null,null,null,"Mujer",3,5.6999999999999993,null,null,3,5.6999999999999993]
[null,null,"Total IncaKola",null,6,11.399999999999999,3,6.3000000000000007,9,17.7]
[null,null,"Otras"]
[null,null,null,"Hombre",null,null,4,0,4,0]
[null,null,null,"Mujer",5,0,4,0,9,0]
[null,null,"Total Otras",null,5,0,8,0,13,0]
[null,null,"PepsiCola"]
[null,null,null,"Mujer",4,6.4,4,8.8000000000000007,8,15.200000000000001]
[null,null,"Total PepsiCola",null,4,6.4,4,8.8000000000000007,8,15.200000000000001]
[null,"Total La Herradura",null,null,27,40.6,18,22,45,62.600000000000009]
[]
[null,"Naplo"]
[null,null,"CocaCola"]
[null,null,null,"Hombre",null,null,1,2.2999999999999998,1,2.2999999999999998]
[null,null,null,"Mujer",5,9.5,null,null,5,9.5]
[null,null,"Total CocaCola",null,5,9.5,1,2.2999999999999998,6,11.8]
[null,null,"IncaKola"]
[null,null,null,"Hombre",3,5.6999999999999993,3,6.3000000000000007,6,12]
[null,null,null,"Mujer",3,5.6999999999999993,6,12.600000000000001,9,18.3]
[null,null,"Total IncaKola",null,6,11.399999999999999,9,18.900000000000002,15,30.3]
[null,null,"Otras"]
[null,null,null,"Hombre",null,null,5,0,5,0]
[null,null,null,"Mujer",10,0,null,null,10,0]
[null,null,"Total Otras",null,10,0,5,0,15,0]
[null,null,"PepsiCola"]
[null,null,null,"Hombre",null,null,4,8.8000000000000007,4,8.8000000000000007]
[null,null,null,"Mujer",3,4.8000000000000007,null,null,3,4.8000000000000007]
[null,null,"Total PepsiCola",null,3,4.8000000000000007,4,8.8000000000000007,7,13.600000000000001]
[null,"Total Naplo",null,null,24,25.7,19,30.000000000000004,43,55.7]
[]
[null,"Pucusana"]
[null,null,"CocaCola"]
[null,null,null,"Hombre",1,1.9,6,13.8,7,15.700000000000001]
[null,null,"Total CocaCola",null,1,1.9,6,13.8,7,15.700000000000001]
[null,null,"IncaKola"]
[null,null,null,"Hombre",4,7.6,3,6.3000000000000007,7,13.9]
[null,null,null,"Mujer",null,null,6,12.6,6,12.6]
[null,null,"Total IncaKola",null,4,7.6,9,18.899999999999999,13,26.5]
[null,null,"Otras"]
[null,null,null,"Hombre",2,0,6,0,8,0]
[null,null,null,"Mujer",5,0,2,0,7,0]
[null,null,"Total Otras",null,7,0,8,0,15,0]
[null,null,"PepsiCola"]
[null,null,null,"Mujer",5,8,5,11,10,19]
[null,null,"Total PepsiCola",null,5,8,5,11,10,19]
[null,"Total Pucusana",null,null,17,17.5,28,43.7,45,61.2]
[]
[null,"San Bartolo"]
[null,null,"CocaCola"]
[null,null,null,"Hombre",2,3.8,1,2.2999999999999998,3,6.1]
[null,null,null,"Mujer",3,5.6999999999999993,null,null,3,5.6999999999999993]
[null,null,"Total CocaCola",null,5,9.5,1,2.2999999999999998,6,11.799999999999999]
[null,null,"IncaKola"]
[null,null,null,"Hombre",null,null,7,14.700000000000001,7,14.700000000000001]
[null,null,null,"Mujer",5,9.5,null,null,5,9.5]
[null,null,"Total IncaKola",null,5,9.5,7,14.700000000000001,12,24.200000000000003]
[null,null,"Otras"]
[null,null,null,"Hombre",5,0,4,0,9,0]
[null,null,null,"Mujer",9,0,5,0,14,0]
[null,null,"Total Otras",null,14,0,9,0,23,0]
[null,null,"PepsiCola"]
[null,null,null,"Mujer",2,3.2,null,null,2,3.2]
[null,null,"Total PepsiCola",null,2,3.2,null,null,2,3.2]
[null,"Total San Bartolo",null,null,26,22.2,17,17,43,39.200000000000003]
[]
[null,"Ventanilla"]
[null,null,"CocaCola"]
[null,null,null,"Hombre",null,null,5,11.5,5,11.5]
[null,null,null,"Mujer",7,13.299999999999999,null,null,7,13.299999999999999]
[null,null,"Total CocaCola",null,7,13.299999999999999,5,11.5,12,24.799999999999997]
[null,null,"IncaKola"]
[null,null,null,"Hombre",2,3.8,4,8.4,6,12.2]
[null,null,"Total IncaKola",null,2,3.8,4,8.4,6,12.2]
[null,null,"Otras"]
[null,null,null,"Hombre",1,0,null,null,1,0]
[null,null,null,"Mujer",4,0,5,0,9,0]
[null,null,"Total Otras",null,5,0,5,0,10,0]
[null,null,"PepsiCola"]
[null,null,null,"Hombre",1,1.6,4,8.8000000000000007,5,10.4]
[null,null,null,"Mujer",5,8,3,6.6000000000000005,8,14.600000000000001]
[null,null,"Total PepsiCola",null,6,9.6,7,15.400000000000002,13,25]
[null,"Total Ventanilla",null,null,20,26.7,21,35.299999999999997,41,62]
[]
[null,"Total general",null,null,169,216.4,146,204.5,315,420.9]